{"text_format":"1","workbook":"xlsx","n_sheets":16,"sheets":["Zapisnik","Prijave","Žreb","Skupina 1","Skupina 2","Skupina 3","Skupina 4","Finalna skupina","Rezultati","Dvoboji","Configuration","CodeLists","Navodila","List1","Sheet2","Sheet1"],"not_rendered":{"charts":0,"images":1,"macros":1,"external_links":1,"defined_names":57,"comments":0,"pivot_tables":0},"unopened":[],"bounds":{"document_bytes":16777216,"sheet_cells":100000,"rows_first":2000,"rows_last":500,"rows_between":2000,"halvings":0,"cell_chars":16384,"cell_head_chars":4096},"cells_cut":0,"cells_raw":0,"read":"whole","date_system":"1900"}

{"sheet":"Zapisnik","index":0,"n_rows":23,"n_cols":2,"rows_kept":23,"cut":false,"hidden":false,"merged":[]}
[]
[null,"Zapisnik tekmovanja"]
[null,"Izpolni BZS"]
[null,"Tekmovanje"]
[null,"Datum"]
[null,"Organizator"]
[null,"Predstavnik organizatorja"]
[null,"Evid. št. tekmovanja"]
[null,"Število nastopajočih"]
[null,"Opombe"]
[null,"Izpolni organizator"]
[null,"Vodja tekmovanja"]
[null,"Pomočnik vodje tekmovanja"]
[null,"Glavni sodnik"]
[null,"Sodniki"]
[null,"Pomožni sodniki"]
[null,"Opombe"]
[null,"Izpolni vodja tekmovanja"]
[null,"Opombe"]
[null,"Izpolni glavni sodnik"]
[null,"Opombe"]
[null,"Izpolni direktor tekmovanj"]
[null,"Opombe"]

{"sheet":"Prijave","index":1,"n_rows":129,"n_cols":11,"rows_kept":129,"cut":false,"hidden":false,"merged":[]}
["Poz.","Tekmovalec",null,"Poz.","Priimek","Ime","Evid. št.","Društvo","Licenca","Nosilec","Prijava"]
[{"$f":"IF(NOT(ISBLANK(D2)),D2,\"\")","v":1},{"$f":"IF(COUNTBLANK(E2:K2)>0,\"\",CONCATENATE(F2,\" \",UPPER(E2)))","v":"Tomaž BENEDIČIČ"},null,1,"Benedičič","Tomaž",1,"Biljard klub Break","Č",19,"Prijava"]
[{"$f":"IF(NOT(ISBLANK(D3)),D3,\"\")","v":2},{"$f":"IF(COUNTBLANK(E3:K3)>0,\"\",CONCATENATE(F3,\" \",UPPER(E3)))","v":"Jan HVALEC"},null,2,"Hvalec","Jan",919,"Biljard klub Break","Č",26,"Naknadna prijava"]
[3,"Lovro KOKOT",null,3,"Kokot","Lovro",915,"Biljard klub Break","Č",25,"Prijava"]
[4,"Mitja GRADIŠNIK",null,4,"Gradišnik","Mitja",92,"Biljard klub Direkt","Č",1,"Prijava"]
[5,"Jurij POTOČNIK",null,5,"Potočnik","Jurij",487,"Biljard klub Direkt","Č",2,"Prijava"]
[6,"Robert REDNAK",null,6,"Rednak","Robert",178,"Biljard klub Direkt","Č",11,"Prijava"]
[7,"Damjan KEREP",null,7,"Kerep","Damjan",300,"Biljard klub Fit-Fit","Č",5,"Prijava"]
[8,"Matjaž ERČULJ",null,8,"Erčulj","Matjaž",80,"Biljard klub Gomes","Č",3,"Prijava"]
[9,"Peter FIJAVŽ",null,9,"Fijavž","Peter",910,"Biljard klub Gomes","Č",23,"Prijava"]
[10,"Ana GRADIŠNIK",null,10,"Gradišnik","Ana",551,"Biljard klub Gomes","Č",6,"Prijava"]
[11,"Kristijan HAMZOVSKI",null,11,"Hamzovski","Kristijan",774,"Biljard klub Gomes","Č",9,"Prijava"]
[12,"Beno MESSNER",null,12,"Messner","Beno",538,"Biljard klub Gomes","Č",14,"Prijava"]
[13,"Sašo MEŽEK",null,13,"Mežek","Sašo",689,"Biljard klub Gorenc","Č",13,"Prijava"]
[14,"Klemen GRADIŠNIK",null,14,"Gradišnik","Klemen",612,"Biljard klub Kaval Premium","Č",4,"Naknadna prijava"]
[15,"Blaž KOLENC",null,15,"Kolenc","Blaž",683,"Biljard klub Osmica","Č",10,"Prijava"]
[16,"Aleksander RAIŠIČ",null,16,"Raišič","Aleksander",220,"Biljard klub Osmica","Č",27,"Naknadna prijava"]
[17,"Boštjan PEMIČ",null,17,"Pemič","Boštjan",678,"Biljard klub Pipipool.com","Č",28,"Naknadna prijava"]
[18,"Igor BAJSIČ",null,18,"Bajsič","Igor",799,"Klub biljardistov Ljubljana","Č",15,"Prijava"]
[19,"Matej BRAJKOVIČ",null,19,"Brajkovič","Matej",440,"Klub biljardistov Ljubljana","Č",24,"Prijava"]
[20,"Franci ČUČNIK",null,20,"Čučnik","Franci",891,"Klub biljardistov Ljubljana","Č",16,"Prijava"]
[21,"Jožef GATEJ",null,21,"Gatej","Jožef",905,"Klub biljardistov Ljubljana","Č",17,"Prijava"]
[22,"Maks GERČAR",null,22,"Gerčar","Maks",888,"Klub biljardistov Ljubljana","Č",18,"Prijava"]
[23,"Denis GODEŠA",null,23,"Godeša","Denis",723,"Klub biljardistov Ljubljana","Č",8,"Prijava"]
[24,"Kristijan NIKL",null,24,"Nikl","Kristijan",595,"Klub biljardistov Ljubljana","Č",20,"Prijava"]
[25,"Nino PORIČ",null,25,"Porič","Nino",866,"Klub biljardistov Ljubljana","Č",21,"Prijava"]
[26,"Levin TKALČIČ",null,26,"Tkalčič","Levin",720,"Klub biljardistov Ljubljana","Č",22,"Prijava"]
[27,"Miha ZAJC",null,27,"Zajc","Miha",589,"Klub biljardistov Ljubljana","Č",7,"Prijava"]
[28,"Janez LAVRIČ",null,28,"Lavrič","Janez",914,"Prosti igralci","Č",12,"Prijava"]
[29,"Iztok DOLINŠEK ",null,29,"Dolinšek ","Iztok",111,"Biljard klub Break","Č",29,"Naknadna prijava"]
[30,"Miha ŽAGAR",null,30,"Žagar","Miha",2,"Biljard klub Fit-Fit","Č",30,"Naknadna prijava"]
[31,"",null,31,null,null,null,null,null,31]
[32,"",null,32,null,null,null,null,null,32]
[33,"",null,33,null,null,null,null,null,33]
[34,"",null,34,null,null,null,null,null,34]
[35,"",null,35,null,null,null,null,null,35]
[36,"",null,36,null,null,null,null,null,36]
[37,"",null,37,null,null,null,null,null,37]
[38,"",null,38,null,null,null,null,null,38]
[39,"",null,39,null,null,null,null,null,39]
[40,"",null,40,null,null,null,null,null,40]
[41,"",null,41]
[42,"",null,42]
[43,"",null,43]
[44,"",null,44]
[45,"",null,45]
[46,"",null,46]
[47,"",null,47]
[48,"",null,48]
[49,"",null,49]
[50,"",null,50]
[51,"",null,51]
[52,"",null,52]
[53,"",null,53]
[54,"",null,54]
[55,"",null,55]
[56,"",null,56]
[57,"",null,57]
[58,"",null,58]
[59,"",null,59]
[60,"",null,60]
[61,"",null,61]
[62,"",null,62]
[63,"",null,63]
[64,"",null,64]
[65,"",null,65]
[{"$f":"IF(NOT(ISBLANK(D67)),D67,\"\")","v":66},{"$f":"IF(COUNTBLANK(E67:K67)>0,\"\",CONCATENATE(F67,\" \",UPPER(E67)))","v":""},null,66]
[67,"",null,67]
[68,"",null,68]
[69,"",null,69]
[70,"",null,70]
[71,"",null,71]
[72,"",null,72]
[73,"",null,73]
[74,"",null,74]
[75,"",null,75]
[76,"",null,76]
[77,"",null,77]
[78,"",null,78]
[79,"",null,79]
[80,"",null,80]
[81,"",null,81]
[82,"",null,82]
[83,"",null,83]
[84,"",null,84]
[85,"",null,85]
[86,"",null,86]
[87,"",null,87]
[88,"",null,88]
[89,"",null,89]
[90,"",null,90]
[91,"",null,91]
[92,"",null,92]
[93,"",null,93]
[94,"",null,94]
[95,"",null,95]
[96,"",null,96]
[97,"",null,97]
[98,"",null,98]
[99,"",null,99]
[100,"",null,100]
[101,"",null,101]
[102,"",null,102]
[103,"",null,103]
[104,"",null,104]
[105,"",null,105]
[106,"",null,106]
[107,"",null,107]
[108,"",null,108]
[109,"",null,109]
[110,"",null,110]
[111,"",null,111]
[112,"",null,112]
[113,"",null,113]
[114,"",null,114]
[115,"",null,115]
[116,"",null,116]
[117,"",null,117]
[118,"",null,118]
[119,"",null,119]
[120,"",null,120]
[121,"",null,121]
[122,"",null,122]
[123,"",null,123]
[124,"",null,124]
[125,"",null,125]
[126,"",null,126]
[127,"",null,127]
[128,"",null,128]

{"sheet":"Žreb","index":2,"n_rows":129,"n_cols":20,"rows_kept":129,"cut":false,"hidden":false,"merged":[]}
["Nosilec","Poz.","Tekmovalec",null,"Nosilec","Status","Žreb","Pozicija","Tekmovalec","Zap. št. prijave","Nosilna poz.",null,null,"Position","Competitor","Announcement",null,"Position","Competitor","Announcement"]
[{"$f":"Prijave!J2","v":19},{"$f":"Prijave!D2","v":1},{"$f":"Prijave!B2","v":"Tomaž BENEDIČIČ"},null,1,"P",null,{"$f":"IF(F2=FinalPreQualifiedDrawState,K2,IF(F2=SeedDrawState,K2,IF(F2=FreeDrawState,K2,IF(ISNUMBER(G2),G2,\"\"))))","v":1},{"$f":"VLOOKUP(E2,DrawCompetitorSeedList,3,FALSE)","v":"Mitja GRADIŠNIK"},{"$f":"VLOOKUP(E2,DrawCompetitorSeedList,2,FALSE)","v":4},{"$f":"IF(F2=FinalPreQualifiedDrawState,VLOOKUP(E2,INDIRECT(CONCATENATE(\"TournamentSheetSeeding\",TournamentFinalSize)),2,),VLOOKUP(E2-TournamentFinalPreQualified,INDIRECT(CONCATENATE(\"TournamentSheetSeeding\",TournamentQualificationSize)),2,))","v":1},null,null,{"$f":"IF(F2=FinalPreQualifiedDrawState,H2,\"\")","v":1},{"$f":"IF(F2=FinalPreQualifiedDrawState,I2,\"\")","v":"Mitja GRADIŠNIK"},{"$f":"IF(F2=FinalPreQualifiedDrawState,J2,\"\")","v":4},null,{"$f":"IF(F2<>FinalPreQualifiedDrawState,H2,\"\")","v":""},{"$f":"IF(F2<>FinalPreQualifiedDrawState,I2,\"\")","v":""},{"$f":"IF(F2<>FinalPreQualifiedDrawState,J2,\"\")","v":""}]
[{"$f":"Prijave!J3","v":26},{"$f":"Prijave!D3","v":2},{"$f":"Prijave!B3","v":"Jan HVALEC"},null,2,"p",null,16,"Jurij POTOČNIK",5,16,null,null,16,"Jurij POTOČNIK",5,null,"","",""]
[{"$f":"Prijave!J4","v":25},{"$f":"Prijave!D4","v":3},{"$f":"Prijave!B4","v":"Lovro KOKOT"},null,3,"p",null,9,"Matjaž ERČULJ",8,9,null,null,9,"Matjaž ERČULJ",8,null,"","",""]
[{"$f":"Prijave!J5","v":1},{"$f":"Prijave!D5","v":4},{"$f":"Prijave!B5","v":"Mitja GRADIŠNIK"},null,4,"p",null,8,"Klemen GRADIŠNIK",14,8,null,null,8,"Klemen GRADIŠNIK",14,null,"","",""]
[{"$f":"Prijave!J6","v":2},{"$f":"Prijave!D6","v":5},{"$f":"Prijave!B6","v":"Jurij POTOČNIK"},null,5,"p",null,5,"Damjan KEREP",7,5,null,null,5,"Damjan KEREP",7,null,"","",""]
[{"$f":"Prijave!J7","v":11},{"$f":"Prijave!D7","v":6},{"$f":"Prijave!B7","v":"Robert REDNAK"},null,6,"p",null,12,"Ana GRADIŠNIK",10,12,null,null,12,"Ana GRADIŠNIK",10,null,"","",""]
[{"$f":"Prijave!J8","v":5},{"$f":"Prijave!D8","v":7},{"$f":"Prijave!B8","v":"Damjan KEREP"},null,7,"p",null,13,"Miha ZAJC",27,13,null,null,13,"Miha ZAJC",27,null,"","",""]
[{"$f":"Prijave!J9","v":3},{"$f":"Prijave!D9","v":8},{"$f":"Prijave!B9","v":"Matjaž ERČULJ"},null,8,"p",null,4,"Denis GODEŠA",23,4,null,null,4,"Denis GODEŠA",23,null,"","",""]
[{"$f":"Prijave!J10","v":23},{"$f":"Prijave!D10","v":9},{"$f":"Prijave!B10","v":"Peter FIJAVŽ"},null,9,"*",5,5,"Kristijan HAMZOVSKI",11,1,null,null,"","","",null,5,"Kristijan HAMZOVSKI",11]
[{"$f":"Prijave!J11","v":6},{"$f":"Prijave!D11","v":10},{"$f":"Prijave!B11","v":"Ana GRADIŠNIK"},null,10,"*",4,4,"Blaž KOLENC",15,32,null,null,"","","",null,4,"Blaž KOLENC",15]
[{"$f":"Prijave!J12","v":9},{"$f":"Prijave!D12","v":11},{"$f":"Prijave!B12","v":"Kristijan HAMZOVSKI"},null,11,"*",3,3,"Robert REDNAK",6,17,null,null,"","","",null,3,"Robert REDNAK",6]
[{"$f":"Prijave!J13","v":14},{"$f":"Prijave!D13","v":12},{"$f":"Prijave!B13","v":"Beno MESSNER"},null,12,"*",9,9,"Janez LAVRIČ",28,16,null,null,"","","",null,9,"Janez LAVRIČ",28]
[{"$f":"Prijave!J14","v":13},{"$f":"Prijave!D14","v":13},{"$f":"Prijave!B14","v":"Sašo MEŽEK"},null,13,"*",32,32,"Sašo MEŽEK",13,9,null,null,"","","",null,32,"Sašo MEŽEK",13]
[{"$f":"Prijave!J15","v":4},{"$f":"Prijave!D15","v":14},{"$f":"Prijave!B15","v":"Klemen GRADIŠNIK"},null,14,"*",11,11,"Beno MESSNER",12,24,null,null,"","","",null,11,"Beno MESSNER",12]
[{"$f":"Prijave!J16","v":10},{"$f":"Prijave!D16","v":15},{"$f":"Prijave!B16","v":"Blaž KOLENC"},null,15,"*",13,13,"Igor BAJSIČ",18,25,null,null,"","","",null,13,"Igor BAJSIČ",18]
[{"$f":"Prijave!J17","v":27},{"$f":"Prijave!D17","v":16},{"$f":"Prijave!B17","v":"Aleksander RAIŠIČ"},null,16,"*",25,25,"Franci ČUČNIK",20,8,null,null,"","","",null,25,"Franci ČUČNIK",20]
[{"$f":"Prijave!J18","v":28},{"$f":"Prijave!D18","v":17},{"$f":"Prijave!B18","v":"Boštjan PEMIČ"},null,17,"*",24,24,"Jožef GATEJ",21,5,null,null,"","","",null,24,"Jožef GATEJ",21]
[{"$f":"Prijave!J19","v":15},{"$f":"Prijave!D19","v":18},{"$f":"Prijave!B19","v":"Igor BAJSIČ"},null,18,"*",8,8,"Maks GERČAR",22,28,null,null,"","","",null,8,"Maks GERČAR",22]
[{"$f":"Prijave!J20","v":24},{"$f":"Prijave!D20","v":19},{"$f":"Prijave!B20","v":"Matej BRAJKOVIČ"},null,19,"*",30,30,"Tomaž BENEDIČIČ",1,21,null,null,"","","",null,30,"Tomaž BENEDIČIČ",1]
[{"$f":"Prijave!J21","v":16},{"$f":"Prijave!D21","v":20},{"$f":"Prijave!B21","v":"Franci ČUČNIK"},null,20,"*",12,12,"Kristijan NIKL",24,12,null,null,"","","",null,12,"Kristijan NIKL",24]
[{"$f":"Prijave!J22","v":17},{"$f":"Prijave!D22","v":21},{"$f":"Prijave!B22","v":"Jožef GATEJ"},null,21,"*",28,28,"Nino PORIČ",25,13,null,null,"","","",null,28,"Nino PORIČ",25]
[{"$f":"Prijave!J23","v":18},{"$f":"Prijave!D23","v":22},{"$f":"Prijave!B23","v":"Maks GERČAR"},null,22,"*",1,1,"Levin TKALČIČ",26,20,null,null,"","","",null,1,"Levin TKALČIČ",26]
[{"$f":"Prijave!J24","v":8},{"$f":"Prijave!D24","v":23},{"$f":"Prijave!B24","v":"Denis GODEŠA"},null,23,"*",17,17,"Peter FIJAVŽ",9,29,null,null,"","","",null,17,"Peter FIJAVŽ",9]
[{"$f":"Prijave!J25","v":20},{"$f":"Prijave!D25","v":24},{"$f":"Prijave!B25","v":"Kristijan NIKL"},null,24,"*",14,14,"Matej BRAJKOVIČ",19,4,null,null,"","","",null,14,"Matej BRAJKOVIČ",19]
[{"$f":"Prijave!J26","v":21},{"$f":"Prijave!D26","v":25},{"$f":"Prijave!B26","v":"Nino PORIČ"},null,25,"*",29,29,"Lovro KOKOT",3,3,null,null,"","","",null,29,"Lovro KOKOT",3]
[{"$f":"Prijave!J27","v":22},{"$f":"Prijave!D27","v":26},{"$f":"Prijave!B27","v":"Levin TKALČIČ"},null,26,"*",16,16,"Jan HVALEC",2,30,null,null,"","","",null,16,"Jan HVALEC",2]
[{"$f":"Prijave!J28","v":7},{"$f":"Prijave!D28","v":27},{"$f":"Prijave!B28","v":"Miha ZAJC"},null,27,"*",21,21,"Aleksander RAIŠIČ",16,19,null,null,"","","",null,21,"Aleksander RAIŠIČ",16]
[{"$f":"Prijave!J29","v":12},{"$f":"Prijave!D29","v":28},{"$f":"Prijave!B29","v":"Janez LAVRIČ"},null,28,"*",19,19,"Boštjan PEMIČ",17,14,null,null,"","","",null,19,"Boštjan PEMIČ",17]
[{"$f":"Prijave!J30","v":29},{"$f":"Prijave!D30","v":29},{"$f":"Prijave!B30","v":"Iztok DOLINŠEK "},null,29,"*",20,20,"Iztok DOLINŠEK ",29,11,null,null,"","","",null,20,"Iztok DOLINŠEK ",29]
[{"$f":"Prijave!J31","v":30},{"$f":"Prijave!D31","v":30},{"$f":"Prijave!B31","v":"Miha ŽAGAR"},null,30,"*",22,22,"Miha ŽAGAR",30,22,null,null,"","","",null,22,"Miha ŽAGAR",30]
[{"$f":"Prijave!J32","v":31},{"$f":"Prijave!D32","v":31},{"$f":"Prijave!B32","v":""},null,31,"f",null,27,"",31,27,null,null,"","","",null,27,"",31]
[{"$f":"Prijave!J33","v":32},{"$f":"Prijave!D33","v":32},{"$f":"Prijave!B33","v":""},null,32,"f",null,6,"",32,6,null,null,"","","",null,6,"",32]
[{"$f":"Prijave!J34","v":33},{"$f":"Prijave!D34","v":33},{"$f":"Prijave!B34","v":""},null,33,"f",null,{"$f":"IF(F34=FinalPreQualifiedDrawState,K34,IF(F34=SeedDrawState,K34,IF(F34=FreeDrawState,K34,IF(ISNUMBER(G34),G34,\"\"))))","v":7},{"$f":"VLOOKUP(E34,DrawCompetitorSeedList,3,FALSE)","v":""},{"$f":"VLOOKUP(E34,DrawCompetitorSeedList,2,FALSE)","v":33},{"$f":"IF(F34=FinalPreQualifiedDrawState,VLOOKUP(E34,INDIRECT(CONCATENATE(\"TournamentSheetSeeding\",TournamentFinalSize)),2,),VLOOKUP(E34-TournamentFinalPreQualified,INDIRECT(CONCATENATE(\"TournamentSheetSeeding\",TournamentQualificationSize)),2,))","v":7},null,null,{"$f":"IF(F34=FinalPreQualifiedDrawState,H34,\"\")","v":""},{"$f":"IF(F34=FinalPreQualifiedDrawState,I34,\"\")","v":""},{"$f":"IF(F34=FinalPreQualifiedDrawState,J34,\"\")","v":""},null,{"$f":"IF(F34<>FinalPreQualifiedDrawState,H34,\"\")","v":7},{"$f":"IF(F34<>FinalPreQualifiedDrawState,I34,\"\")","v":""},{"$f":"IF(F34<>FinalPreQualifiedDrawState,J34,\"\")","v":33}]
[{"$f":"Prijave!J35","v":34},{"$f":"Prijave!D35","v":34},{"$f":"Prijave!B35","v":""},null,34,"f",null,26,"",34,26,null,null,"","","",null,26,"",34]
[{"$f":"Prijave!J36","v":35},{"$f":"Prijave!D36","v":35},{"$f":"Prijave!B36","v":""},null,35,"f",null,23,"",35,23,null,null,"","","",null,23,"",35]
[{"$f":"Prijave!J37","v":36},{"$f":"Prijave!D37","v":36},{"$f":"Prijave!B37","v":""},null,36,"f",null,10,"",36,10,null,null,"","","",null,10,"",36]
[{"$f":"Prijave!J38","v":37},{"$f":"Prijave!D38","v":37},{"$f":"Prijave!B38","v":""},null,37,"f",null,15,"",37,15,null,null,"","","",null,15,"",37]
[{"$f":"Prijave!J39","v":38},{"$f":"Prijave!D39","v":38},{"$f":"Prijave!B39","v":""},null,38,"f",null,18,"",38,18,null,null,"","","",null,18,"",38]
[{"$f":"Prijave!J40","v":39},{"$f":"Prijave!D40","v":39},{"$f":"Prijave!B40","v":""},null,39,"f",null,31,"",39,31,null,null,"","","",null,31,"",39]
[{"$f":"Prijave!J41","v":40},{"$f":"Prijave!D41","v":40},{"$f":"Prijave!B41","v":""},null,40,"f",null,2,"",40,2,null,null,"","","",null,2,"",40]
[{"$f":"Prijave!J42","v":0},{"$f":"Prijave!D42","v":41},{"$f":"Prijave!B42","v":""},null,41,"*",null,"",{"$error":"#N/A"},{"$error":"#N/A"},{"$error":"#N/A"},null,null,"","","",null,"",{"$error":"#N/A"},{"$error":"#N/A"}]
[{"$f":"Prijave!J43","v":0},{"$f":"Prijave!D43","v":42},{"$f":"Prijave!B43","v":""},null,42,"*",null,"",{"$error":"#N/A"},{"$error":"#N/A"},{"$error":"#N/A"},null,null,"","","",null,"",{"$error":"#N/A"},{"$error":"#N/A"}]
[{"$f":"Prijave!J44","v":0},{"$f":"Prijave!D44","v":43},{"$f":"Prijave!B44","v":""},null,43,"*",null,"",{"$error":"#N/A"},{"$error":"#N/A"},{"$error":"#N/A"},null,null,"","","",null,"",{"$error":"#N/A"},{"$error":"#N/A"}]
[{"$f":"Prijave!J45","v":0},{"$f":"Prijave!D45","v":44},{"$f":"Prijave!B45","v":""},null,44,"*",null,"",{"$error":"#N/A"},{"$error":"#N/A"},{"$error":"#N/A"},null,null,"","","",null,"",{"$error":"#N/A"},{"$error":"#N/A"}]
[{"$f":"Prijave!J46","v":0},{"$f":"Prijave!D46","v":45},{"$f":"Prijave!B46","v":""},null,45,"*",null,"",{"$error":"#N/A"},{"$error":"#N/A"},{"$error":"#N/A"},null,null,"","","",null,"",{"$error":"#N/A"},{"$error":"#N/A"}]
[{"$f":"Prijave!J47","v":0},{"$f":"Prijave!D47","v":46},{"$f":"Prijave!B47","v":""},null,46,"*",null,"",{"$error":"#N/A"},{"$error":"#N/A"},{"$error":"#N/A"},null,null,"","","",null,"",{"$error":"#N/A"},{"$error":"#N/A"}]
[{"$f":"Prijave!J48","v":0},{"$f":"Prijave!D48","v":47},{"$f":"Prijave!B48","v":""},null,47,"*",null,"",{"$error":"#N/A"},{"$error":"#N/A"},{"$error":"#N/A"},null,null,"","","",null,"",{"$error":"#N/A"},{"$error":"#N/A"}]
[{"$f":"Prijave!J49","v":0},{"$f":"Prijave!D49","v":48},{"$f":"Prijave!B49","v":""},null,48,"*",null,"",{"$error":"#N/A"},{"$error":"#N/A"},{"$error":"#N/A"},null,null,"","","",null,"",{"$error":"#N/A"},{"$error":"#N/A"}]
[{"$f":"Prijave!J50","v":0},{"$f":"Prijave!D50","v":49},{"$f":"Prijave!B50","v":""},null,49,"*",null,"",{"$error":"#N/A"},{"$error":"#N/A"},{"$error":"#N/A"},null,null,"","","",null,"",{"$error":"#N/A"},{"$error":"#N/A"}]
[{"$f":"Prijave!J51","v":0},{"$f":"Prijave!D51","v":50},{"$f":"Prijave!B51","v":""},null,50,"*",null,"",{"$error":"#N/A"},{"$error":"#N/A"},{"$error":"#N/A"},null,null,"","","",null,"",{"$error":"#N/A"},{"$error":"#N/A"}]
[{"$f":"Prijave!J52","v":0},{"$f":"Prijave!D52","v":51},{"$f":"Prijave!B52","v":""},null,51,"*",null,"",{"$error":"#N/A"},{"$error":"#N/A"},{"$error":"#N/A"},null,null,"","","",null,"",{"$error":"#N/A"},{"$error":"#N/A"}]
[{"$f":"Prijave!J53","v":0},{"$f":"Prijave!D53","v":52},{"$f":"Prijave!B53","v":""},null,52,"*",null,"",{"$error":"#N/A"},{"$error":"#N/A"},{"$error":"#N/A"},null,null,"","","",null,"",{"$error":"#N/A"},{"$error":"#N/A"}]
[{"$f":"Prijave!J54","v":0},{"$f":"Prijave!D54","v":53},{"$f":"Prijave!B54","v":""},null,53,"*",null,"",{"$error":"#N/A"},{"$error":"#N/A"},{"$error":"#N/A"},null,null,"","","",null,"",{"$error":"#N/A"},{"$error":"#N/A"}]
[{"$f":"Prijave!J55","v":0},{"$f":"Prijave!D55","v":54},{"$f":"Prijave!B55","v":""},null,54,"*",null,"",{"$error":"#N/A"},{"$error":"#N/A"},{"$error":"#N/A"},null,null,"","","",null,"",{"$error":"#N/A"},{"$error":"#N/A"}]
[{"$f":"Prijave!J56","v":0},{"$f":"Prijave!D56","v":55},{"$f":"Prijave!B56","v":""},null,55,"*",null,"",{"$error":"#N/A"},{"$error":"#N/A"},{"$error":"#N/A"},null,null,"","","",null,"",{"$error":"#N/A"},{"$error":"#N/A"}]
[{"$f":"Prijave!J57","v":0},{"$f":"Prijave!D57","v":56},{"$f":"Prijave!B57","v":""},null,56,"*",null,"",{"$error":"#N/A"},{"$error":"#N/A"},{"$error":"#N/A"},null,null,"","","",null,"",{"$error":"#N/A"},{"$error":"#N/A"}]
[{"$f":"Prijave!J58","v":0},{"$f":"Prijave!D58","v":57},{"$f":"Prijave!B58","v":""},null,57,"*",null,"",{"$error":"#N/A"},{"$error":"#N/A"},{"$error":"#N/A"},null,null,"","","",null,"",{"$error":"#N/A"},{"$error":"#N/A"}]
[{"$f":"Prijave!J59","v":0},{"$f":"Prijave!D59","v":58},{"$f":"Prijave!B59","v":""},null,58,"*",null,"",{"$error":"#N/A"},{"$error":"#N/A"},{"$error":"#N/A"},null,null,"","","",null,"",{"$error":"#N/A"},{"$error":"#N/A"}]
[{"$f":"Prijave!J60","v":0},{"$f":"Prijave!D60","v":59},{"$f":"Prijave!B60","v":""},null,59,"*",null,"",{"$error":"#N/A"},{"$error":"#N/A"},{"$error":"#N/A"},null,null,"","","",null,"",{"$error":"#N/A"},{"$error":"#N/A"}]
[{"$f":"Prijave!J61","v":0},{"$f":"Prijave!D61","v":60},{"$f":"Prijave!B61","v":""},null,60,"*",null,"",{"$error":"#N/A"},{"$error":"#N/A"},{"$error":"#N/A"},null,null,"","","",null,"",{"$error":"#N/A"},{"$error":"#N/A"}]
[{"$f":"Prijave!J62","v":0},{"$f":"Prijave!D62","v":61},{"$f":"Prijave!B62","v":""},null,61,"*",null,"",{"$error":"#N/A"},{"$error":"#N/A"},{"$error":"#N/A"},null,null,"","","",null,"",{"$error":"#N/A"},{"$error":"#N/A"}]
[{"$f":"Prijave!J63","v":0},{"$f":"Prijave!D63","v":62},{"$f":"Prijave!B63","v":""},null,62,"*",null,"",{"$error":"#N/A"},{"$error":"#N/A"},{"$error":"#N/A"},null,null,"","","",null,"",{"$error":"#N/A"},{"$error":"#N/A"}]
[{"$f":"Prijave!J64","v":0},{"$f":"Prijave!D64","v":63},{"$f":"Prijave!B64","v":""},null,63,"*",null,"",{"$error":"#N/A"},{"$error":"#N/A"},{"$error":"#N/A"},null,null,"","","",null,"",{"$error":"#N/A"},{"$error":"#N/A"}]
[{"$f":"Prijave!J65","v":0},{"$f":"Prijave!D65","v":64},{"$f":"Prijave!B65","v":""},null,64,"*",null,"",{"$error":"#N/A"},{"$error":"#N/A"},{"$error":"#N/A"},null,null,"","","",null,"",{"$error":"#N/A"},{"$error":"#N/A"}]
[{"$f":"Prijave!J66","v":0},{"$f":"Prijave!D66","v":65},{"$f":"Prijave!B66","v":""},null,65,"*",null,{"$f":"IF(F66=FinalPreQualifiedDrawState,K66,IF(F66=SeedDrawState,K66,IF(F66=FreeDrawState,K66,IF(ISNUMBER(G66),G66,\"\"))))","v":""},{"$f":"VLOOKUP(E66,DrawCompetitorSeedList,3,FALSE)","v":{"$error":"#N/A"}},{"$f":"VLOOKUP(E66,DrawCompetitorSeedList,2,FALSE)","v":{"$error":"#N/A"}},{"$f":"IF(F66=FinalPreQualifiedDrawState,VLOOKUP(E66,INDIRECT(CONCATENATE(\"TournamentSheetSeeding\",TournamentFinalSize)),2,),VLOOKUP(E66-TournamentFinalPreQualified,INDIRECT(CONCATENATE(\"TournamentSheetSeeding\",TournamentQualificationSize)),2,))","v":{"$error":"#N/A"}},null,null,{"$f":"IF(F66=FinalPreQualifiedDrawState,H66,\"\")","v":""},{"$f":"IF(F66=FinalPreQualifiedDrawState,I66,\"\")","v":""},{"$f":"IF(F66=FinalPreQualifiedDrawState,J66,\"\")","v":""},null,{"$f":"IF(F66<>FinalPreQualifiedDrawState,H66,\"\")","v":""},{"$f":"IF(F66<>FinalPreQualifiedDrawState,I66,\"\")","v":{"$error":"#N/A"}},{"$f":"IF(F66<>FinalPreQualifiedDrawState,J66,\"\")","v":{"$error":"#N/A"}}]
[{"$f":"Prijave!J67","v":0},{"$f":"Prijave!D67","v":66},{"$f":"Prijave!B67","v":""},null,66,"*",null,"",{"$error":"#N/A"},{"$error":"#N/A"},{"$error":"#N/A"},null,null,"","","",null,"",{"$error":"#N/A"},{"$error":"#N/A"}]
[{"$f":"Prijave!J68","v":0},{"$f":"Prijave!D68","v":67},{"$f":"Prijave!B68","v":""},null,67,"*",null,"",{"$error":"#N/A"},{"$error":"#N/A"},{"$error":"#N/A"},null,null,"","","",null,"",{"$error":"#N/A"},{"$error":"#N/A"}]
[{"$f":"Prijave!J69","v":0},{"$f":"Prijave!D69","v":68},{"$f":"Prijave!B69","v":""},null,68,"*",null,"",{"$error":"#N/A"},{"$error":"#N/A"},{"$error":"#N/A"},null,null,"","","",null,"",{"$error":"#N/A"},{"$error":"#N/A"}]
[{"$f":"Prijave!J70","v":0},{"$f":"Prijave!D70","v":69},{"$f":"Prijave!B70","v":""},null,69,"*",null,"",{"$error":"#N/A"},{"$error":"#N/A"},{"$error":"#N/A"},null,null,"","","",null,"",{"$error":"#N/A"},{"$error":"#N/A"}]
[{"$f":"Prijave!J71","v":0},{"$f":"Prijave!D71","v":70},{"$f":"Prijave!B71","v":""},null,70,"*",null,"",{"$error":"#N/A"},{"$error":"#N/A"},{"$error":"#N/A"},null,null,"","","",null,"",{"$error":"#N/A"},{"$error":"#N/A"}]
[{"$f":"Prijave!J72","v":0},{"$f":"Prijave!D72","v":71},{"$f":"Prijave!B72","v":""},null,71,"*",null,"",{"$error":"#N/A"},{"$error":"#N/A"},{"$error":"#N/A"},null,null,"","","",null,"",{"$error":"#N/A"},{"$error":"#N/A"}]
[{"$f":"Prijave!J73","v":0},{"$f":"Prijave!D73","v":72},{"$f":"Prijave!B73","v":""},null,72,"*",null,"",{"$error":"#N/A"},{"$error":"#N/A"},{"$error":"#N/A"},null,null,"","","",null,"",{"$error":"#N/A"},{"$error":"#N/A"}]
[{"$f":"Prijave!J74","v":0},{"$f":"Prijave!D74","v":73},{"$f":"Prijave!B74","v":""},null,73,"*",null,"",{"$error":"#N/A"},{"$error":"#N/A"},{"$error":"#N/A"},null,null,"","","",null,"",{"$error":"#N/A"},{"$error":"#N/A"}]
[{"$f":"Prijave!J75","v":0},{"$f":"Prijave!D75","v":74},{"$f":"Prijave!B75","v":""},null,74,"*",null,"",{"$error":"#N/A"},{"$error":"#N/A"},{"$error":"#N/A"},null,null,"","","",null,"",{"$error":"#N/A"},{"$error":"#N/A"}]
[{"$f":"Prijave!J76","v":0},{"$f":"Prijave!D76","v":75},{"$f":"Prijave!B76","v":""},null,75,"*",null,"",{"$error":"#N/A"},{"$error":"#N/A"},{"$error":"#N/A"},null,null,"","","",null,"",{"$error":"#N/A"},{"$error":"#N/A"}]
[{"$f":"Prijave!J77","v":0},{"$f":"Prijave!D77","v":76},{"$f":"Prijave!B77","v":""},null,76,"*",null,"",{"$error":"#N/A"},{"$error":"#N/A"},{"$error":"#N/A"},null,null,"","","",null,"",{"$error":"#N/A"},{"$error":"#N/A"}]
[{"$f":"Prijave!J78","v":0},{"$f":"Prijave!D78","v":77},{"$f":"Prijave!B78","v":""},null,77,"*",null,"",{"$error":"#N/A"},{"$error":"#N/A"},{"$error":"#N/A"},null,null,"","","",null,"",{"$error":"#N/A"},{"$error":"#N/A"}]
[{"$f":"Prijave!J79","v":0},{"$f":"Prijave!D79","v":78},{"$f":"Prijave!B79","v":""},null,78,"*",null,"",{"$error":"#N/A"},{"$error":"#N/A"},{"$error":"#N/A"},null,null,"","","",null,"",{"$error":"#N/A"},{"$error":"#N/A"}]
[{"$f":"Prijave!J80","v":0},{"$f":"Prijave!D80","v":79},{"$f":"Prijave!B80","v":""},null,79,"*",null,"",{"$error":"#N/A"},{"$error":"#N/A"},{"$error":"#N/A"},null,null,"","","",null,"",{"$error":"#N/A"},{"$error":"#N/A"}]
[{"$f":"Prijave!J81","v":0},{"$f":"Prijave!D81","v":80},{"$f":"Prijave!B81","v":""},null,80,"*",null,"",{"$error":"#N/A"},{"$error":"#N/A"},{"$error":"#N/A"},null,null,"","","",null,"",{"$error":"#N/A"},{"$error":"#N/A"}]
[{"$f":"Prijave!J82","v":0},{"$f":"Prijave!D82","v":81},{"$f":"Prijave!B82","v":""},null,81,"*",null,"",{"$error":"#N/A"},{"$error":"#N/A"},{"$error":"#N/A"},null,null,"","","",null,"",{"$error":"#N/A"},{"$error":"#N/A"}]
[{"$f":"Prijave!J83","v":0},{"$f":"Prijave!D83","v":82},{"$f":"Prijave!B83","v":""},null,82,"*",null,"",{"$error":"#N/A"},{"$error":"#N/A"},{"$error":"#N/A"},null,null,"","","",null,"",{"$error":"#N/A"},{"$error":"#N/A"}]
[{"$f":"Prijave!J84","v":0},{"$f":"Prijave!D84","v":83},{"$f":"Prijave!B84","v":""},null,83,"*",null,"",{"$error":"#N/A"},{"$error":"#N/A"},{"$error":"#N/A"},null,null,"","","",null,"",{"$error":"#N/A"},{"$error":"#N/A"}]
[{"$f":"Prijave!J85","v":0},{"$f":"Prijave!D85","v":84},{"$f":"Prijave!B85","v":""},null,84,"*",null,"",{"$error":"#N/A"},{"$error":"#N/A"},{"$error":"#N/A"},null,null,"","","",null,"",{"$error":"#N/A"},{"$error":"#N/A"}]
[{"$f":"Prijave!J86","v":0},{"$f":"Prijave!D86","v":85},{"$f":"Prijave!B86","v":""},null,85,"*",null,"",{"$error":"#N/A"},{"$error":"#N/A"},{"$error":"#N/A"},null,null,"","","",null,"",{"$error":"#N/A"},{"$error":"#N/A"}]
[{"$f":"Prijave!J87","v":0},{"$f":"Prijave!D87","v":86},{"$f":"Prijave!B87","v":""},null,86,"*",null,"",{"$error":"#N/A"},{"$error":"#N/A"},{"$error":"#N/A"},null,null,"","","",null,"",{"$error":"#N/A"},{"$error":"#N/A"}]
[{"$f":"Prijave!J88","v":0},{"$f":"Prijave!D88","v":87},{"$f":"Prijave!B88","v":""},null,87,"*",null,"",{"$error":"#N/A"},{"$error":"#N/A"},{"$error":"#N/A"},null,null,"","","",null,"",{"$error":"#N/A"},{"$error":"#N/A"}]
[{"$f":"Prijave!J89","v":0},{"$f":"Prijave!D89","v":88},{"$f":"Prijave!B89","v":""},null,88,"*",null,"",{"$error":"#N/A"},{"$error":"#N/A"},{"$error":"#N/A"},null,null,"","","",null,"",{"$error":"#N/A"},{"$error":"#N/A"}]
[{"$f":"Prijave!J90","v":0},{"$f":"Prijave!D90","v":89},{"$f":"Prijave!B90","v":""},null,89,"*",null,"",{"$error":"#N/A"},{"$error":"#N/A"},{"$error":"#N/A"},null,null,"","","",null,"",{"$error":"#N/A"},{"$error":"#N/A"}]
[{"$f":"Prijave!J91","v":0},{"$f":"Prijave!D91","v":90},{"$f":"Prijave!B91","v":""},null,90,"*",null,"",{"$error":"#N/A"},{"$error":"#N/A"},{"$error":"#N/A"},null,null,"","","",null,"",{"$error":"#N/A"},{"$error":"#N/A"}]
[{"$f":"Prijave!J92","v":0},{"$f":"Prijave!D92","v":91},{"$f":"Prijave!B92","v":""},null,91,"*",null,"",{"$error":"#N/A"},{"$error":"#N/A"},{"$error":"#N/A"},null,null,"","","",null,"",{"$error":"#N/A"},{"$error":"#N/A"}]
[{"$f":"Prijave!J93","v":0},{"$f":"Prijave!D93","v":92},{"$f":"Prijave!B93","v":""},null,92,"*",null,"",{"$error":"#N/A"},{"$error":"#N/A"},{"$error":"#N/A"},null,null,"","","",null,"",{"$error":"#N/A"},{"$error":"#N/A"}]
[{"$f":"Prijave!J94","v":0},{"$f":"Prijave!D94","v":93},{"$f":"Prijave!B94","v":""},null,93,"*",null,"",{"$error":"#N/A"},{"$error":"#N/A"},{"$error":"#N/A"},null,null,"","","",null,"",{"$error":"#N/A"},{"$error":"#N/A"}]
[{"$f":"Prijave!J95","v":0},{"$f":"Prijave!D95","v":94},{"$f":"Prijave!B95","v":""},null,94,"*",null,"",{"$error":"#N/A"},{"$error":"#N/A"},{"$error":"#N/A"},null,null,"","","",null,"",{"$error":"#N/A"},{"$error":"#N/A"}]
[{"$f":"Prijave!J96","v":0},{"$f":"Prijave!D96","v":95},{"$f":"Prijave!B96","v":""},null,95,"*",null,"",{"$error":"#N/A"},{"$error":"#N/A"},{"$error":"#N/A"},null,null,"","","",null,"",{"$error":"#N/A"},{"$error":"#N/A"}]
[{"$f":"Prijave!J97","v":0},{"$f":"Prijave!D97","v":96},{"$f":"Prijave!B97","v":""},null,96,"*",null,"",{"$error":"#N/A"},{"$error":"#N/A"},{"$error":"#N/A"},null,null,"","","",null,"",{"$error":"#N/A"},{"$error":"#N/A"}]
[{"$f":"Prijave!J98","v":0},{"$f":"Prijave!D98","v":97},{"$f":"Prijave!B98","v":""},null,97,"*",null,{"$f":"IF(F98=FinalPreQualifiedDrawState,K98,IF(F98=SeedDrawState,K98,IF(F98=FreeDrawState,K98,IF(ISNUMBER(G98),G98,\"\"))))","v":""},{"$error":"#N/A"},{"$error":"#N/A"},{"$f":"IF(F98=FinalPreQualifiedDrawState,VLOOKUP(E98,INDIRECT(CONCATENATE(\"TournamentSheetSeeding\",TournamentFinalSize)),2,),VLOOKUP(E98-TournamentFinalPreQualified,INDIRECT(CONCATENATE(\"TournamentSheetSeeding\",TournamentQualificationSize)),2,))","v":{"$error":"#N/A"}},null,null,{"$f":"IF(F98=FinalPreQualifiedDrawState,H98,\"\")","v":""},{"$f":"IF(F98=FinalPreQualifiedDrawState,I98,\"\")","v":""},{"$f":"IF(F98=FinalPreQualifiedDrawState,J98,\"\")","v":""},null,{"$f":"IF(F98<>FinalPreQualifiedDrawState,H98,\"\")","v":""},{"$f":"IF(F98<>FinalPreQualifiedDrawState,I98,\"\")","v":{"$error":"#N/A"}},{"$f":"IF(F98<>FinalPreQualifiedDrawState,J98,\"\")","v":{"$error":"#N/A"}}]
[{"$f":"Prijave!J99","v":0},{"$f":"Prijave!D99","v":98},{"$f":"Prijave!B99","v":""},null,98,"*",null,"",{"$error":"#N/A"},{"$error":"#N/A"},{"$error":"#N/A"},null,null,"","","",null,"",{"$error":"#N/A"},{"$error":"#N/A"}]
[{"$f":"Prijave!J100","v":0},{"$f":"Prijave!D100","v":99},{"$f":"Prijave!B100","v":""},null,99,"*",null,"",{"$error":"#N/A"},{"$error":"#N/A"},{"$error":"#N/A"},null,null,"","","",null,"",{"$error":"#N/A"},{"$error":"#N/A"}]
[{"$f":"Prijave!J101","v":0},{"$f":"Prijave!D101","v":100},{"$f":"Prijave!B101","v":""},null,100,"*",null,"",{"$error":"#N/A"},{"$error":"#N/A"},{"$error":"#N/A"},null,null,"","","",null,"",{"$error":"#N/A"},{"$error":"#N/A"}]
[{"$f":"Prijave!J102","v":0},{"$f":"Prijave!D102","v":101},{"$f":"Prijave!B102","v":""},null,101,"*",null,"",{"$error":"#N/A"},{"$error":"#N/A"},{"$error":"#N/A"},null,null,"","","",null,"",{"$error":"#N/A"},{"$error":"#N/A"}]
[{"$f":"Prijave!J103","v":0},{"$f":"Prijave!D103","v":102},{"$f":"Prijave!B103","v":""},null,102,"*",null,"",{"$error":"#N/A"},{"$error":"#N/A"},{"$error":"#N/A"},null,null,"","","",null,"",{"$error":"#N/A"},{"$error":"#N/A"}]
[{"$f":"Prijave!J104","v":0},{"$f":"Prijave!D104","v":103},{"$f":"Prijave!B104","v":""},null,103,"*",null,"",{"$error":"#N/A"},{"$error":"#N/A"},{"$error":"#N/A"},null,null,"","","",null,"",{"$error":"#N/A"},{"$error":"#N/A"}]
[{"$f":"Prijave!J105","v":0},{"$f":"Prijave!D105","v":104},{"$f":"Prijave!B105","v":""},null,104,"*",null,"",{"$error":"#N/A"},{"$error":"#N/A"},{"$error":"#N/A"},null,null,"","","",null,"",{"$error":"#N/A"},{"$error":"#N/A"}]
[{"$f":"Prijave!J106","v":0},{"$f":"Prijave!D106","v":105},{"$f":"Prijave!B106","v":""},null,105,"*",null,"",{"$error":"#N/A"},{"$error":"#N/A"},{"$error":"#N/A"},null,null,"","","",null,"",{"$error":"#N/A"},{"$error":"#N/A"}]
[{"$f":"Prijave!J107","v":0},{"$f":"Prijave!D107","v":106},{"$f":"Prijave!B107","v":""},null,106,"*",null,"",{"$error":"#N/A"},{"$error":"#N/A"},{"$error":"#N/A"},null,null,"","","",null,"",{"$error":"#N/A"},{"$error":"#N/A"}]
[{"$f":"Prijave!J108","v":0},{"$f":"Prijave!D108","v":107},{"$f":"Prijave!B108","v":""},null,107,"*",null,"",{"$error":"#N/A"},{"$error":"#N/A"},{"$error":"#N/A"},null,null,"","","",null,"",{"$error":"#N/A"},{"$error":"#N/A"}]
[{"$f":"Prijave!J109","v":0},{"$f":"Prijave!D109","v":108},{"$f":"Prijave!B109","v":""},null,108,"*",null,"",{"$error":"#N/A"},{"$error":"#N/A"},{"$error":"#N/A"},null,null,"","","",null,"",{"$error":"#N/A"},{"$error":"#N/A"}]
[{"$f":"Prijave!J110","v":0},{"$f":"Prijave!D110","v":109},{"$f":"Prijave!B110","v":""},null,109,"*",null,"",{"$error":"#N/A"},{"$error":"#N/A"},{"$error":"#N/A"},null,null,"","","",null,"",{"$error":"#N/A"},{"$error":"#N/A"}]
[{"$f":"Prijave!J111","v":0},{"$f":"Prijave!D111","v":110},{"$f":"Prijave!B111","v":""},null,110,"*",null,"",{"$error":"#N/A"},{"$error":"#N/A"},{"$error":"#N/A"},null,null,"","","",null,"",{"$error":"#N/A"},{"$error":"#N/A"}]
[{"$f":"Prijave!J112","v":0},{"$f":"Prijave!D112","v":111},{"$f":"Prijave!B112","v":""},null,111,"*",null,"",{"$error":"#N/A"},{"$error":"#N/A"},{"$error":"#N/A"},null,null,"","","",null,"",{"$error":"#N/A"},{"$error":"#N/A"}]
[{"$f":"Prijave!J113","v":0},{"$f":"Prijave!D113","v":112},{"$f":"Prijave!B113","v":""},null,112,"*",null,"",{"$error":"#N/A"},{"$error":"#N/A"},{"$error":"#N/A"},null,null,"","","",null,"",{"$error":"#N/A"},{"$error":"#N/A"}]
[{"$f":"Prijave!J114","v":0},{"$f":"Prijave!D114","v":113},{"$f":"Prijave!B114","v":""},null,113,"*",null,"",{"$error":"#N/A"},{"$error":"#N/A"},{"$error":"#N/A"},null,null,"","","",null,"",{"$error":"#N/A"},{"$error":"#N/A"}]
[{"$f":"Prijave!J115","v":0},{"$f":"Prijave!D115","v":114},{"$f":"Prijave!B115","v":""},null,114,"*",null,"",{"$error":"#N/A"},{"$error":"#N/A"},{"$error":"#N/A"},null,null,"","","",null,"",{"$error":"#N/A"},{"$error":"#N/A"}]
[{"$f":"Prijave!J116","v":0},{"$f":"Prijave!D116","v":115},{"$f":"Prijave!B116","v":""},null,115,"*",null,"",{"$error":"#N/A"},{"$error":"#N/A"},{"$error":"#N/A"},null,null,"","","",null,"",{"$error":"#N/A"},{"$error":"#N/A"}]
[{"$f":"Prijave!J117","v":0},{"$f":"Prijave!D117","v":116},{"$f":"Prijave!B117","v":""},null,116,"*",null,"",{"$error":"#N/A"},{"$error":"#N/A"},{"$error":"#N/A"},null,null,"","","",null,"",{"$error":"#N/A"},{"$error":"#N/A"}]
[{"$f":"Prijave!J118","v":0},{"$f":"Prijave!D118","v":117},{"$f":"Prijave!B118","v":""},null,117,"*",null,"",{"$error":"#N/A"},{"$error":"#N/A"},{"$error":"#N/A"},null,null,"","","",null,"",{"$error":"#N/A"},{"$error":"#N/A"}]
[{"$f":"Prijave!J119","v":0},{"$f":"Prijave!D119","v":118},{"$f":"Prijave!B119","v":""},null,118,"*",null,"",{"$error":"#N/A"},{"$error":"#N/A"},{"$error":"#N/A"},null,null,"","","",null,"",{"$error":"#N/A"},{"$error":"#N/A"}]
[{"$f":"Prijave!J120","v":0},{"$f":"Prijave!D120","v":119},{"$f":"Prijave!B120","v":""},null,119,"*",null,"",{"$error":"#N/A"},{"$error":"#N/A"},{"$error":"#N/A"},null,null,"","","",null,"",{"$error":"#N/A"},{"$error":"#N/A"}]
[{"$f":"Prijave!J121","v":0},{"$f":"Prijave!D121","v":120},{"$f":"Prijave!B121","v":""},null,120,"*",null,"",{"$error":"#N/A"},{"$error":"#N/A"},{"$error":"#N/A"},null,null,"","","",null,"",{"$error":"#N/A"},{"$error":"#N/A"}]
[{"$f":"Prijave!J122","v":0},{"$f":"Prijave!D122","v":121},{"$f":"Prijave!B122","v":""},null,121,"*",null,"",{"$error":"#N/A"},{"$error":"#N/A"},{"$error":"#N/A"},null,null,"","","",null,"",{"$error":"#N/A"},{"$error":"#N/A"}]
[{"$f":"Prijave!J123","v":0},{"$f":"Prijave!D123","v":122},{"$f":"Prijave!B123","v":""},null,122,"*",null,"",{"$error":"#N/A"},{"$error":"#N/A"},{"$error":"#N/A"},null,null,"","","",null,"",{"$error":"#N/A"},{"$error":"#N/A"}]
[{"$f":"Prijave!J124","v":0},{"$f":"Prijave!D124","v":123},{"$f":"Prijave!B124","v":""},null,123,"*",null,"",{"$error":"#N/A"},{"$error":"#N/A"},{"$error":"#N/A"},null,null,"","","",null,"",{"$error":"#N/A"},{"$error":"#N/A"}]
[{"$f":"Prijave!J125","v":0},{"$f":"Prijave!D125","v":124},{"$f":"Prijave!B125","v":""},null,124,"*",null,"",{"$error":"#N/A"},{"$error":"#N/A"},{"$error":"#N/A"},null,null,"","","",null,"",{"$error":"#N/A"},{"$error":"#N/A"}]
[{"$f":"Prijave!J126","v":0},{"$f":"Prijave!D126","v":125},{"$f":"Prijave!B126","v":""},null,125,"*",null,"",{"$error":"#N/A"},{"$error":"#N/A"},{"$error":"#N/A"},null,null,"","","",null,"",{"$error":"#N/A"},{"$error":"#N/A"}]
[{"$f":"Prijave!J127","v":0},{"$f":"Prijave!D127","v":126},{"$f":"Prijave!B127","v":""},null,126,"*",null,"",{"$error":"#N/A"},{"$error":"#N/A"},{"$error":"#N/A"},null,null,"","","",null,"",{"$error":"#N/A"},{"$error":"#N/A"}]
[{"$f":"Prijave!J128","v":0},{"$f":"Prijave!D128","v":127},{"$f":"Prijave!B128","v":""},null,127,"*",null,"",{"$error":"#N/A"},{"$error":"#N/A"},{"$error":"#N/A"},null,null,"","","",null,"",{"$error":"#N/A"},{"$error":"#N/A"}]
[{"$f":"Prijave!J129","v":0},{"$f":"Prijave!D129","v":128},{"$f":"Prijave!B129","v":""},null,128,"*",null,"",{"$error":"#N/A"},{"$error":"#N/A"},{"$error":"#N/A"},null,null,"","","",null,"",{"$error":"#N/A"},{"$error":"#N/A"}]

{"sheet":"Skupina 1","index":3,"n_rows":42,"n_cols":101,"rows_kept":42,"cut":false,"hidden":false,"merged":[[39,7,40,7],[39,8,39,10],[39,15,40,15],[39,16,39,18],[39,23,40,23],[39,24,39,26],[33,31,34,31],[33,32,33,34],[34,8,34,10],[34,16,34,18],[34,24,34,26],[34,32,34,34],[39,31,40,31],[39,32,39,34],[40,8,40,10],[40,16,40,18],[40,24,40,26],[40,32,40,34],[38,9,38,10],[38,17,38,18],[38,25,38,26],[38,33,38,34],[32,9,32,10],[32,17,32,18],[32,25,32,26],[32,33,32,34],[33,7,34,7],[33,8,33,10],[33,15,34,15],[33,16,33,18],[33,23,34,23],[33,24,33,26],[21,31,22,31],[21,32,21,34],[22,8,22,10],[22,16,22,18],[22,24,22,26],[22,32,22,34],[27,31,28,31],[27,32,27,34],[28,8,28,10],[28,16,28,18],[28,24,28,26],[28,32,28,34],[26,9,26,10],[26,17,26,18],[26,25,26,26],[26,33,26,34],[21,7,22,7],[21,8,21,10],[21,15,22,15],[21,16,21,18],[21,23,22,23],[21,24,21,26],[27,7,28,7],[27,8,27,10],[27,15,28,15],[27,16,27,18],[27,23,28,23],[27,24,27,26],[16,32,16,34],[14,9,14,10],[14,17,14,18],[14,25,14,26],[14,33,14,34],[20,9,20,10],[20,17,20,18],[20,25,20,26],[20,33,20,34],[15,7,16,7],[15,8,15,10],[15,15,16,15],[15,16,15,18],[15,23,16,23],[15,24,15,26],[9,31,10,31],[9,32,9,34],[9,53,10,53],[10,8,10,10],[10,16,10,18],[10,24,10,26],[10,32,10,34],[9,7,10,7],[9,8,9,10],[9,15,10,15],[9,16,9,18],[9,23,10,23],[9,24,9,26],[15,31,16,31],[15,32,15,34],[16,8,16,10],[16,16,16,18],[16,24,16,26],[5,53,6,53],[7,53,8,53],[8,9,8,10],[8,17,8,18],[8,25,8,26],[8,33,8,34],[3,24,3,26],[3,31,4,31],[3,32,3,34],[3,53,4,53],[4,8,4,10],[4,16,4,18],[4,24,4,26],[4,32,4,34],[0,0,0,4],[2,9,2,10],[2,17,2,18],[2,25,2,26],[2,33,2,34],[3,7,4,7],[3,8,3,10],[3,15,4,15],[3,16,3,18],[3,23,4,23]]}
["Nastavitve",null,null,null,null,null,"Group","Round","Order","Match","P1","P2",null,null,null,null,null,null,null,null,null,null,null,null,null,null,null,null,null,null,null,null,null,null,null,null,null,null,null,null,null,null,null,null,null,null,null,null,null,null,null,null,null,null,null,null,null,null,null,null,null,null,null,null,null,null,null,null,null,null,null,null,null,null,null,null,null,null,"Match","Row","Col","Address","Group","Match nr.","Table","Scheduled time","Target","Notes","Start time","End time","Duration","P1 Name","P1 Code","P1 Score","P1 State","P2 Name","P2 Code","P2 Score","P2 State","Match State","Is Valid"]
["Skupina",1,null,null,null,null,1,1,1,{"$f":"((H2-1)*$B$3)+I2","v":1},2,7,null,null,{"$f":"G2","v":1},{"$f":"H2","v":1},{"$f":"I2+1","v":2},{"$f":"((P2-1)*$B$3)+Q2","v":2},3,6,null,null,{"$f":"O2","v":1},{"$f":"P2","v":1},{"$f":"Q2+1","v":3},{"$f":"((X2-1)*$B$3)+Y2","v":3},4,5,null,null,{"$f":"W2","v":1},{"$f":"X2","v":1},{"$f":"Y2+1","v":4},{"$f":"((AF2-1)*$B$3)+AG2","v":4},1,8,null,null,null,null,null,null,null,null,null,null,null,null,null,null,null,null,null,null,null,null,null,null,null,null,null,null,null,null,null,null,null,null,null,null,null,null,null,null,null,null,null,null,1,{"$f":"ROW(H4)","v":4},{"$f":"COLUMN(H4)","v":8},{"$f":"ADDRESS(CB2,CC2)","v":"$H$4"},{"$f":"CONCATENATE($B$2)","v":"1"},{"$f":"INDIRECT(CD2)","v":1},{"$f":"CONCATENATE(OFFSET(INDIRECT(CD2),2,0))","v":""},{"$f":"OFFSET(INDIRECT(CD2),-1,1)","v":"09:00:00"},{"$f":"OFFSET(INDIRECT(CD2),-1,4)","v":0},{"$f":"CONCATENATE(OFFSET(INDIRECT(CD2),-1,2))","v":""},{"$f":"OFFSET(INDIRECT(CD2),2,1)","v":"00:00:00"},{"$f":"OFFSET(INDIRECT(CD2),2,2)","v":"00:00:00"},{"$f":"OFFSET(INDIRECT(CD2),2,3)","v":""},{"$f":"OFFSET(INDIRECT(CD2),0,1)","v":""},{"$f":"VLOOKUP(CN2,AnnouncementListCompetitors,6,FALSE)","v":0},{"$f":"OFFSET(INDIRECT(CD2),0,4)","v":0},{"$f":"OFFSET(INDIRECT(CD2),0,5)","v":0},{"$f":"OFFSET(INDIRECT(CD2),1,1)","v":""},{"$f":"VLOOKUP(CR2,AnnouncementListCompetitors,6,FALSE)","v":0},{"$f":"OFFSET(INDIRECT(CD2),1,4)","v":0},{"$f":"OFFSET(INDIRECT(CD2),1,5)","v":0},{"$f":"OFFSET(INDIRECT(CD2),2,4)","v":0},{"$f":"IF(OFFSET(INDIRECT(CD2),2,5)=1,TRUE,FALSE)","v":false}]
["Št. dvobojev na kolo",4,null,null,null,null,{"$f":"CELL(\"address\",OFFSET($A$5,K2,0))","v":"$A$7"},{"$f":"IF(AND(NOT(ISBLANK(I4)),I4<>UnsetMatchCompetitorText,I4<>AwaitingMatchCompetitorText,NOT(ISBLANK(I5)),I5<>UnsetMatchCompetitorText,I5<>AwaitingMatchCompetitorText),1,IF(AND(I4<>AwaitingMatchCompetitorText,I5<>AwaitingMatchCompetitorText),-1,0))","v":1},"09:00:00",null,null,null,null,null,{"$f":"CELL(\"address\",OFFSET($A$5,S2,0))","v":"$A$8"},{"$f":"IF(AND(NOT(ISBLANK(Q4)),Q4<>UnsetMatchCompetitorText,Q4<>AwaitingMatchCompetitorText,NOT(ISBLANK(Q5)),Q5<>UnsetMatchCompetitorText,Q5<>AwaitingMatchCompetitorText),1,IF(AND(Q4<>AwaitingMatchCompetitorText,Q5<>AwaitingMatchCompetitorText),-1,0))","v":1},"09:00:00",null,null,null,null,null,{"$f":"CELL(\"address\",OFFSET($A$5,AA2,0))","v":"$A$9"},{"$f":"IF(AND(NOT(ISBLANK(Y4)),Y4<>UnsetMatchCompetitorText,Y4<>AwaitingMatchCompetitorText,NOT(ISBLANK(Y5)),Y5<>UnsetMatchCompetitorText,Y5<>AwaitingMatchCompetitorText),1,IF(AND(Y4<>AwaitingMatchCompetitorText,Y5<>AwaitingMatchCompetitorText),-1,0))","v":1},"09:00:00",null,null,5,null,null,{"$f":"CELL(\"address\",OFFSET($A$5,AI2,0))","v":"$A$6"},{"$f":"IF(AND(NOT(ISBLANK(AG4)),AG4<>UnsetMatchCompetitorText,AG4<>AwaitingMatchCompetitorText,NOT(ISBLANK(AG5)),AG5<>UnsetMatchCompetitorText,AG5<>AwaitingMatchCompetitorText),1,IF(AND(AG4<>AwaitingMatchCompetitorText,AG5<>AwaitingMatchCompetitorText),-1,0))","v":1},"09:00:00",null,null,5,null,null,null,null,null,null,null,null,null,null,null,null,null,null,null,null,null,null,"Tekmovalec","Tekme","+","-","+/-","Zmage","Poz.","Uvrst.","Žreb",null,null,"R",null,"S",null,null,null,null,null,null,null,null,null,null,2,{"$f":"CB2","v":4},{"$f":"CC2+8","v":16},"$P$4",{"$f":"CONCATENATE($B$2)","v":"1"},2,"","09:00:00",0,"","00:00:00","00:00:00","","Robert REDNAK",{"$f":"VLOOKUP(CN3,AnnouncementListCompetitors,6,FALSE)","v":178},0,0,"",{"$f":"VLOOKUP(CR3,AnnouncementListCompetitors,6,FALSE)","v":0},0,0,0,false]
[null,null,null,null,null,null,"*",{"$f":"J2","v":1},{"$f":"IF(G4=\"*\",IF(AND(OFFSET(INDIRECT(G3),0,0)>0,NOT(ISNA(OFFSET(INDIRECT(G3),0,1)))),OFFSET(INDIRECT(G3),0,1),UnsetMatchCompetitorText),IF(OFFSET(INDIRECT(G3),2,5)>0,IF(COUNTIF(INDIRECT(G4),(OFFSET(INDIRECT(G3),0,5)))>0,OFFSET(INDIRECT(G3),0,1),IF(COUNTIF(INDIRECT(G4),(OFFSET(INDIRECT(G3),1,5)))>0,OFFSET(INDIRECT(G3),1,1),BlankMatchCompetitorText)),AwaitingMatchCompetitorText))","v":""},null,null,null,null,{"$f":"IF(M4=NormalWinState,AND(M5=NormalLoseState,L4>L5),TRUE)","v":true},"*",{"$f":"R2","v":2},{"$f":"IF(O4=\"*\",IF(AND(OFFSET(INDIRECT(O3),0,0)>0,NOT(ISNA(OFFSET(INDIRECT(O3),0,1)))),OFFSET(INDIRECT(O3),0,1),UnsetMatchCompetitorText),IF(OFFSET(INDIRECT(O3),2,5)>0,IF(COUNTIF(INDIRECT(O4),(OFFSET(INDIRECT(O3),0,5)))>0,OFFSET(INDIRECT(O3),0,1),IF(COUNTIF(INDIRECT(O4),(OFFSET(INDIRECT(O3),1,5)))>0,OFFSET(INDIRECT(O3),1,1),BlankMatchCompetitorText)),AwaitingMatchCompetitorText))","v":"Robert REDNAK"},null,null,null,null,{"$f":"IF(U4=NormalWinState,AND(U5=NormalLoseState,T4>T5),TRUE)","v":true},"*",{"$f":"Z2","v":3},{"$f":"IF(W4=\"*\",IF(AND(OFFSET(INDIRECT(W3),0,0)>0,NOT(ISNA(OFFSET(INDIRECT(W3),0,1)))),OFFSET(INDIRECT(W3),0,1),UnsetMatchCompetitorText),IF(OFFSET(INDIRECT(W3),2,5)>0,IF(COUNTIF(INDIRECT(W4),(OFFSET(INDIRECT(W3),0,5)))>0,OFFSET(INDIRECT(W3),0,1),IF(COUNTIF(INDIRECT(W4),(OFFSET(INDIRECT(W3),1,5)))>0,OFFSET(INDIRECT(W3),1,1),BlankMatchCompetitorText)),AwaitingMatchCompetitorText))","v":"Blaž KOLENC"},null,null,0,"L",{"$f":"IF(AC4=NormalWinState,AND(AC5=NormalLoseState,AB4>AB5),TRUE)","v":true},"*",{"$f":"AH2","v":4},{"$f":"IF(AE4=\"*\",IF(AND(OFFSET(INDIRECT(AE3),0,0)>0,NOT(ISNA(OFFSET(INDIRECT(AE3),0,1)))),OFFSET(INDIRECT(AE3),0,1),UnsetMatchCompetitorText),IF(OFFSET(INDIRECT(AE3),2,5)>0,IF(COUNTIF(INDIRECT(AE4),(OFFSET(INDIRECT(AE3),0,5)))>0,OFFSET(INDIRECT(AE3),0,1),IF(COUNTIF(INDIRECT(AE4),(OFFSET(INDIRECT(AE3),1,5)))>0,OFFSET(INDIRECT(AE3),1,1),BlankMatchCompetitorText)),AwaitingMatchCompetitorText))","v":"Levin TKALČIČ"},null,null,3,"L",{"$f":"IF(AK4=NormalWinState,AND(AK5=NormalLoseState,AJ4>AJ5),TRUE)","v":true},null,null,null,null,null,null,null,null,null,null,null,null,null,null,null,null,{"$f":"B6","v":"Levin TKALČIČ"},{"$f":"IF(COUNTIF(FinishedMatchStates,AJ6),1,0)+IF(L12=FinishedMatchStates,1,0)+IF(L18=FinishedMatchStates,1,0)+IF(L24=FinishedMatchStates,1,0)+IF(L30=FinishedMatchStates,1,0)+IF(L36=FinishedMatchStates,1,0)+IF(L42=FinishedMatchStates,1,0)","v":4},{"$f":"AJ4+L10+L17+L22+L29+L34+L41","v":10},{"$f":"AJ5+L11+L16+L23+L28+L35+L40","v":20},{"$f":"BE4-BF4","v":-10},{"$f":"IF(COUNTIF(WinStates,AK4),1,0)+IF(COUNTIF(WinStates,M10),1,0)+IF(COUNTIF(WinStates,M17),1,0)+IF(COUNTIF(WinStates,M22),1,0)+IF(COUNTIF(WinStates,M29),1,0)+IF(COUNTIF(WinStates,M34),1,0)+IF(COUNTIF(WinStates,M41),1,0)","v":0},{"$f":"8-IF(BH4>=BH5,1,0)-IF(BH4>=BH6,1,0)-IF(BH4>=BH7,1,0)-IF(BH4>=BH8,1,0)-IF(BH4>=BH9,1,0)-IF(BH4>=BH10,1,0)-IF(BH4>=BH11,1,0)","v":5},null,null,null,null,{"$f":"BJ4","v":0},{"$f":"BC4","v":"Levin TKALČIČ"},{"$f":"IF(ISBLANK(BK4),\"\",BK4)","v":""},null,null,null,null,null,null,null,null,null,null,3,{"$f":"CB3","v":4},{"$f":"CC3+8","v":24},"$X$4",{"$f":"CONCATENATE($B$2)","v":"1"},3,"2","09:00:00",5,"","10:08:00","10:38:00","00:30:00","Blaž KOLENC",683,0,"L","Kristijan HAMZOVSKI",774,5,"W","F",true]
["Poz.","Tekmovalec",null,null,null,null,{"$f":"CELL(\"address\",OFFSET($A$5,L2,0))","v":"$A$12"},null,{"$f":"IF(G6=\"*\",IF(AND(OFFSET(INDIRECT(G5),0,0)>0,NOT(ISNA(OFFSET(INDIRECT(G5),0,1)))),OFFSET(INDIRECT(G5),0,1),UnsetMatchCompetitorText),IF(OFFSET(INDIRECT(G5),2,5)>0,IF(COUNTIF(INDIRECT(G6),(OFFSET(INDIRECT(G5),0,5)))>0,OFFSET(INDIRECT(G5),0,1),IF(COUNTIF(INDIRECT(G6),(OFFSET(INDIRECT(G5),1,5)))>0,OFFSET(INDIRECT(G5),1,1),BlankMatchCompetitorText)),AwaitingMatchCompetitorText))","v":""},null,null,null,null,{"$f":"IF(M5=NormalWinState,AND(M4=NormalLoseState,L5>L4),TRUE)","v":true},{"$f":"CELL(\"address\",OFFSET($A$5,T2,0))","v":"$A$11"},null,{"$f":"IF(O6=\"*\",IF(AND(OFFSET(INDIRECT(O5),0,0)>0,NOT(ISNA(OFFSET(INDIRECT(O5),0,1)))),OFFSET(INDIRECT(O5),0,1),UnsetMatchCompetitorText),IF(OFFSET(INDIRECT(O5),2,5)>0,IF(COUNTIF(INDIRECT(O6),(OFFSET(INDIRECT(O5),0,5)))>0,OFFSET(INDIRECT(O5),0,1),IF(COUNTIF(INDIRECT(O6),(OFFSET(INDIRECT(O5),1,5)))>0,OFFSET(INDIRECT(O5),1,1),BlankMatchCompetitorText)),AwaitingMatchCompetitorText))","v":""},null,null,null,null,{"$f":"IF(U5=NormalWinState,AND(U4=NormalLoseState,T5>T4),TRUE)","v":true},{"$f":"CELL(\"address\",OFFSET($A$5,AB2,0))","v":"$A$10"},null,{"$f":"IF(W6=\"*\",IF(AND(OFFSET(INDIRECT(W5),0,0)>0,NOT(ISNA(OFFSET(INDIRECT(W5),0,1)))),OFFSET(INDIRECT(W5),0,1),UnsetMatchCompetitorText),IF(OFFSET(INDIRECT(W5),2,5)>0,IF(COUNTIF(INDIRECT(W6),(OFFSET(INDIRECT(W5),0,5)))>0,OFFSET(INDIRECT(W5),0,1),IF(COUNTIF(INDIRECT(W6),(OFFSET(INDIRECT(W5),1,5)))>0,OFFSET(INDIRECT(W5),1,1),BlankMatchCompetitorText)),AwaitingMatchCompetitorText))","v":"Kristijan HAMZOVSKI"},null,null,5,"W",{"$f":"IF(AC5=NormalWinState,AND(AC4=NormalLoseState,AB5>AB4),TRUE)","v":true},{"$f":"CELL(\"address\",OFFSET($A$5,AJ2,0))","v":"$A$13"},null,{"$f":"IF(AE6=\"*\",IF(AND(OFFSET(INDIRECT(AE5),0,0)>0,NOT(ISNA(OFFSET(INDIRECT(AE5),0,1)))),OFFSET(INDIRECT(AE5),0,1),UnsetMatchCompetitorText),IF(OFFSET(INDIRECT(AE5),2,5)>0,IF(COUNTIF(INDIRECT(AE6),(OFFSET(INDIRECT(AE5),0,5)))>0,OFFSET(INDIRECT(AE5),0,1),IF(COUNTIF(INDIRECT(AE6),(OFFSET(INDIRECT(AE5),1,5)))>0,OFFSET(INDIRECT(AE5),1,1),BlankMatchCompetitorText)),AwaitingMatchCompetitorText))","v":"Maks GERČAR"},null,null,5,"W",{"$f":"IF(AK5=NormalWinState,AND(AK4=NormalLoseState,AJ5>AJ4),TRUE)","v":true},null,null,null,null,null,null,null,null,null,null,null,null,null,null,null,null,"",{"$f":"IF(L6=FinishedMatchStates,1,0)+IF(L12=FinishedMatchStates,1,0)+IF(AJ18=FinishedMatchStates,1,0)+IF(T24=FinishedMatchStates,1,0)+IF(T30=FinishedMatchStates,1,0)+IF(T36=FinishedMatchStates,1,0)+IF(T42=FinishedMatchStates,1,0)","v":0},{"$f":"L4+L11+AJ16+T22+T29+T34+T41","v":0},{"$f":"L5+L10+AJ17+T23+T28+T35+T40","v":0},0,{"$f":"IF(COUNTIF(WinStates,M4),1,0)+IF(COUNTIF(WinStates,M11),1,0)+IF(COUNTIF(WinStates,AK16),1,0)+IF(COUNTIF(WinStates,U22),1,0)+IF(COUNTIF(WinStates,U29),1,0)+IF(COUNTIF(WinStates,U34),1,0)+IF(COUNTIF(WinStates,U41),1,0)","v":0},{"$f":"8-IF(BH5>=BH4,1,0)-IF(BH5>=BH6,1,0)-IF(BH5>=BH7,1,0)-IF(BH5>=BH8,1,0)-IF(BH5>=BH9,1,0)-IF(BH5>=BH10,1,0)-IF(BH5>=BH11,1,0)","v":5},null,null,null,null,{"$f":"BJ5","v":0},{"$f":"BC5","v":""},"",null,null,null,null,null,null,null,null,null,null,4,{"$f":"CB4","v":4},{"$f":"CC4+8","v":32},"$AF$4",{"$f":"CONCATENATE($B$2)","v":"1"},4,"1","09:00:00",5,"","09:10:00","10:18:00","01:08:00","Levin TKALČIČ",720,3,"L","Maks GERČAR",888,5,"W","F",true]
[{"$f":"($B$2-1)*TournamentGroupSize+1","v":1},{"$f":"VLOOKUP(A6,DrawSheetPositionCompetitorsQualification,2,FALSE)","v":"Levin TKALČIČ"},null,null,null,null,"*",null,null,null,{"$f":"IF(ISBLANK(I6),\"\",IF(ISBLANK(J6),CurrentTime-I6,J6-I6))","v":""},null,{"$f":"IF(AND(COUNTIF(FinishedMatchStates,L6),NOT(ISNA(VLOOKUP(M4,MatchCompetitorStateCodes,1,FALSE))),NOT(ISNA(VLOOKUP(M5,MatchCompetitorStateCodes,1,FALSE))),COUNTIF(WinStates,M4)+COUNTIF(WinStates,M5)<=1,COUNTIF(LoseStates,M4)+COUNTIF(LoseStates,M5)<=1,IF(M4=NormalWinState,AND(M5=NormalLoseState,L4>L5),TRUE),IF(M5=NormalWinState,AND(M4=NormalLoseState,L5>L4),TRUE),NOT(ISBLANK(L3)),NOT(ISBLANK(I3)),NOT(ISBLANK(I6)),NOT(ISBLANK(J6)),H3>0),1,IF(COUNTIF(FinishedMatchStates,L6)>0,-1,0))","v":0},null,"*",null,null,null,{"$f":"IF(ISBLANK(Q6),\"\",IF(ISBLANK(R6),CurrentTime-Q6,R6-Q6))","v":""},null,{"$f":"IF(AND(COUNTIF(FinishedMatchStates,T6),NOT(ISNA(VLOOKUP(U4,MatchCompetitorStateCodes,1,FALSE))),NOT(ISNA(VLOOKUP(U5,MatchCompetitorStateCodes,1,FALSE))),COUNTIF(WinStates,U4)+COUNTIF(WinStates,U5)<=1,COUNTIF(LoseStates,U4)+COUNTIF(LoseStates,U5)<=1,IF(U4=NormalWinState,AND(U5=NormalLoseState,T4>T5),TRUE),IF(U5=NormalWinState,AND(U4=NormalLoseState,T5>T4),TRUE),NOT(ISBLANK(T3)),NOT(ISBLANK(Q3)),NOT(ISBLANK(Q6)),NOT(ISBLANK(R6)),P3>0),1,IF(COUNTIF(FinishedMatchStates,T6)>0,-1,0))","v":0},null,"*",2,"10:08:00","10:38:00",{"$f":"IF(ISBLANK(Y6),\"\",IF(ISBLANK(Z6),CurrentTime-Y6,Z6-Y6))","v":"00:30:00"},"F",{"$f":"IF(AND(COUNTIF(FinishedMatchStates,AB6),NOT(ISNA(VLOOKUP(AC4,MatchCompetitorStateCodes,1,FALSE))),NOT(ISNA(VLOOKUP(AC5,MatchCompetitorStateCodes,1,FALSE))),COUNTIF(WinStates,AC4)+COUNTIF(WinStates,AC5)<=1,COUNTIF(LoseStates,AC4)+COUNTIF(LoseStates,AC5)<=1,IF(AC4=NormalWinState,AND(AC5=NormalLoseState,AB4>AB5),TRUE),IF(AC5=NormalWinState,AND(AC4=NormalLoseState,AB5>AB4),TRUE),NOT(ISBLANK(AB3)),NOT(ISBLANK(Y3)),NOT(ISBLANK(Y6)),NOT(ISBLANK(Z6)),X3>0),1,IF(COUNTIF(FinishedMatchStates,AB6)>0,-1,0))","v":1},null,"*",1,"09:10:00","10:18:00",{"$f":"IF(ISBLANK(AG6),\"\",IF(ISBLANK(AH6),CurrentTime-AG6,AH6-AG6))","v":"01:08:00"},"F",{"$f":"IF(AND(COUNTIF(FinishedMatchStates,AJ6),NOT(ISNA(VLOOKUP(AK4,MatchCompetitorStateCodes,1,FALSE))),NOT(ISNA(VLOOKUP(AK5,MatchCompetitorStateCodes,1,FALSE))),COUNTIF(WinStates,AK4)+COUNTIF(WinStates,AK5)<=1,COUNTIF(LoseStates,AK4)+COUNTIF(LoseStates,AK5)<=1,IF(AK4=NormalWinState,AND(AK5=NormalLoseState,AJ4>AJ5),TRUE),IF(AK5=NormalWinState,AND(AK4=NormalLoseState,AJ5>AJ4),TRUE),NOT(ISBLANK(AJ3)),NOT(ISBLANK(AG3)),NOT(ISBLANK(AG6)),NOT(ISBLANK(AH6)),AF3>0),1,IF(COUNTIF(FinishedMatchStates,AJ6)>0,-1,0))","v":1},null,null,null,null,null,null,null,null,null,null,null,null,null,null,null,null,null,"Robert REDNAK",{"$f":"IF(T6=FinishedMatchStates,1,0)+IF(T12=FinishedMatchStates,1,0)+IF(L18=FinishedMatchStates,1,0)+IF(T24=FinishedMatchStates,1,0)+IF(AJ30=FinishedMatchStates,1,0)+IF(AB36=FinishedMatchStates,1,0)+IF(AB42=FinishedMatchStates,1,0)","v":4},{"$f":"T4+T11+L16+T23+AJ28+AB34+AB41","v":16},{"$f":"T5+T10+L17+T22+AJ29+AB35+AB40","v":17},{"$f":"BE6-BF6","v":-1},{"$f":"IF(COUNTIF(WinStates,U4),1,0)+IF(COUNTIF(WinStates,U11),1,0)+IF(COUNTIF(WinStates,M16),1,0)+IF(COUNTIF(WinStates,U23),1,0)+IF(COUNTIF(WinStates,AK28),1,0)+IF(COUNTIF(WinStates,AC34),1,0)+IF(COUNTIF(WinStates,AC41),1,0)","v":2},{"$f":"8-IF(BH6>=BH5,1,0)-IF(BH6>=BH4,1,0)-IF(BH6>=BH7,1,0)-IF(BH6>=BH8,1,0)-IF(BH6>=BH9,1,0)-IF(BH6>=BH10,1,0)-IF(BH6>=BH11,1,0)","v":2},2,null,null,null,2,"Robert REDNAK",{"$f":"IF(ISBLANK(BK6),\"\",BK6)","v":""},null,null,null,null,null,null,null,null,null,null,5,{"$f":"CB2+6","v":10},{"$f":"CC2","v":8},"$H$10",{"$f":"CONCATENATE($B$2)","v":"1"},5,"","09:00:00",0,"","00:00:00","00:00:00","","Levin TKALČIČ",720,0,0,"",0,0,0,0,false]
[{"$f":"A6+1","v":2},"",null,null,null,null,null,null,null,null,null,null,null,null,null,null,null,null,null,null,null,null,null,null,null,null,null,null,null,null,null,null,null,null,null,null,null,null,null,null,null,null,null,null,null,null,null,null,null,null,null,null,null,null,"Blaž KOLENC",{"$f":"IF(AB6=FinishedMatchStates,1,0)+IF(AB12=FinishedMatchStates,1,0)+IF(T18=FinishedMatchStates,1,0)+IF(L24=FinishedMatchStates,1,0)+IF(T30=FinishedMatchStates,1,0)+IF(AB36=FinishedMatchStates,1,0)+IF(AJ42=FinishedMatchStates,1,0)","v":4},{"$f":"AB4+AB11+T16+L23+T28+AB35+AJ40","v":14},{"$f":"AB5+AB10+T17+L22+T29+AB34+AJ41","v":15},-1,{"$f":"IF(COUNTIF(WinStates,AC4),1,0)+IF(COUNTIF(WinStates,AC11),1,0)+IF(COUNTIF(WinStates,U16),1,0)+IF(COUNTIF(WinStates,M23),1,0)+IF(COUNTIF(WinStates,U28),1,0)+IF(COUNTIF(WinStates,AC35),1,0)+IF(COUNTIF(WinStates,AK40),1,0)","v":2},{"$f":"8-IF(BH7>=BH5,1,0)-IF(BH7>=BH6,1,0)-IF(BH7>=BH4,1,0)-IF(BH7>=BH8,1,0)-IF(BH7>=BH9,1,0)-IF(BH7>=BH10,1,0)-IF(BH7>=BH11,1,0)","v":2},null,null,null,null,0,"Blaž KOLENC",{"$f":"IF(ISBLANK(BK7),\"\",BK7)","v":""},null,null,null,null,null,null,null,null,null,null,6,{"$f":"CB6","v":10},{"$f":"CC6+8","v":16},"$P$10",{"$f":"CONCATENATE($B$2)","v":"1"},6,"","09:00:00",0,"","00:00:00","00:00:00","","",0,0,0,"Robert REDNAK",178,0,0,0,false]
[{"$f":"A7+1","v":3},"Robert REDNAK",null,null,null,null,{"$f":"G2","v":1},{"$f":"H2+1","v":2},{"$f":"I2","v":1},{"$f":"((H8-1)*$B$3)+I8","v":5},1,2,null,null,{"$f":"G8","v":1},{"$f":"H8","v":2},{"$f":"I8+1","v":2},{"$f":"((P8-1)*$B$3)+Q8","v":6},7,3,null,null,{"$f":"O8","v":1},{"$f":"P8","v":2},{"$f":"Q8+1","v":3},{"$f":"((X8-1)*$B$3)+Y8","v":7},6,4,null,null,{"$f":"W8","v":1},{"$f":"X8","v":2},{"$f":"Y8+1","v":4},{"$f":"((AF8-1)*$B$3)+AG8","v":8},8,5,null,null,null,null,null,null,null,null,null,null,null,null,null,null,null,null,null,null,"Kristijan HAMZOVSKI",{"$f":"IF(AB6=FinishedMatchStates,1,0)+IF(AJ12=FinishedMatchStates,1,0)+IF(AB18=FinishedMatchStates,1,0)+IF(AB24=FinishedMatchStates,1,0)+IF(L30=FinishedMatchStates,1,0)+IF(T36=FinishedMatchStates,1,0)+IF(AB42=FinishedMatchStates,1,0)","v":4},{"$f":"AB5+AJ11+AB16+AB23+L28+T35+AB40","v":20},{"$f":"AB4+AJ10+AB17+AB22+L29+T34+AB41","v":3},17,{"$f":"IF(COUNTIF(WinStates,AC5),1,0)+IF(COUNTIF(WinStates,AK11),1,0)+IF(COUNTIF(WinStates,AC16),1,0)+IF(COUNTIF(WinStates,AC23),1,0)+IF(COUNTIF(WinStates,M28),1,0)+IF(COUNTIF(WinStates,U35),1,0)+IF(COUNTIF(WinStates,AC40),1,0)","v":4},{"$f":"8-IF(BH8>=BH5,1,0)-IF(BH8>=BH6,1,0)-IF(BH8>=BH7,1,0)-IF(BH8>=BH4,1,0)-IF(BH8>=BH9,1,0)-IF(BH8>=BH10,1,0)-IF(BH8>=BH11,1,0)","v":1},1,null,null,null,1,"Kristijan HAMZOVSKI","",null,null,null,null,null,null,null,null,null,null,7,{"$f":"CB7","v":10},{"$f":"CC7+8","v":24},"$X$10",{"$f":"CONCATENATE($B$2)","v":"1"},7,"","09:00:00",0,"","00:00:00","00:00:00","","",0,0,0,"Blaž KOLENC",683,0,0,0,false]
[4,"Blaž KOLENC",null,null,null,null,{"$f":"CELL(\"address\",OFFSET($A$5,K8,0))","v":"$A$6"},{"$f":"IF(AND(NOT(ISBLANK(I10)),I10<>UnsetMatchCompetitorText,I10<>AwaitingMatchCompetitorText,NOT(ISBLANK(I11)),I11<>UnsetMatchCompetitorText,I11<>AwaitingMatchCompetitorText),1,IF(AND(I10<>AwaitingMatchCompetitorText,I11<>AwaitingMatchCompetitorText),-1,0))","v":1},"09:00:00",null,null,null,null,null,{"$f":"CELL(\"address\",OFFSET($A$5,S8,0))","v":"$A$12"},{"$f":"IF(AND(NOT(ISBLANK(Q10)),Q10<>UnsetMatchCompetitorText,Q10<>AwaitingMatchCompetitorText,NOT(ISBLANK(Q11)),Q11<>UnsetMatchCompetitorText,Q11<>AwaitingMatchCompetitorText),1,IF(AND(Q10<>AwaitingMatchCompetitorText,Q11<>AwaitingMatchCompetitorText),-1,0))","v":1},"09:00:00",null,null,null,null,null,{"$f":"CELL(\"address\",OFFSET($A$5,AA8,0))","v":"$A$11"},{"$f":"IF(AND(NOT(ISBLANK(Y10)),Y10<>UnsetMatchCompetitorText,Y10<>AwaitingMatchCompetitorText,NOT(ISBLANK(Y11)),Y11<>UnsetMatchCompetitorText,Y11<>AwaitingMatchCompetitorText),1,IF(AND(Y10<>AwaitingMatchCompetitorText,Y11<>AwaitingMatchCompetitorText),-1,0))","v":1},"09:00:00",null,null,null,null,null,{"$f":"CELL(\"address\",OFFSET($A$5,AI8,0))","v":"$A$13"},{"$f":"IF(AND(NOT(ISBLANK(AG10)),AG10<>UnsetMatchCompetitorText,AG10<>AwaitingMatchCompetitorText,NOT(ISBLANK(AG11)),AG11<>UnsetMatchCompetitorText,AG11<>AwaitingMatchCompetitorText),1,IF(AND(AG10<>AwaitingMatchCompetitorText,AG11<>AwaitingMatchCompetitorText),-1,0))","v":1},"09:00:00",null,null,5,null,null,null,null,null,null,null,null,null,null,null,null,null,null,null,null,null,null,"",{"$f":"IF(T6=FinishedMatchStates,1,0)+IF(AB12=FinishedMatchStates,1,0)+IF(AB18=FinishedMatchStates,1,0)+IF(AJ24=FinishedMatchStates,1,0)+IF(AB30=FinishedMatchStates,1,0)+IF(L36=FinishedMatchStates,1,0)+IF(T42=FinishedMatchStates,1,0)","v":0},{"$f":"T5+AB10+AB17+AJ23+AB28+L35+T40","v":0},{"$f":"T4+AB11+AB16+AJ22+AB29+L34+T41","v":0},0,{"$f":"IF(COUNTIF(WinStates,U5),1,0)+IF(COUNTIF(WinStates,AC10),1,0)+IF(COUNTIF(WinStates,AC17),1,0)+IF(COUNTIF(WinStates,AK23),1,0)+IF(COUNTIF(WinStates,AC28),1,0)+IF(COUNTIF(WinStates,M35),1,0)+IF(COUNTIF(WinStates,U40),1,0)","v":0},{"$f":"8-IF(BH9>=BH5,1,0)-IF(BH9>=BH6,1,0)-IF(BH9>=BH7,1,0)-IF(BH9>=BH8,1,0)-IF(BH9>=BH4,1,0)-IF(BH9>=BH10,1,0)-IF(BH9>=BH11,1,0)","v":5},null,null,null,null,0,"","",null,null,null,null,null,null,null,null,null,null,8,{"$f":"CB8","v":10},{"$f":"CC8+8","v":32},"$AF$10",{"$f":"CONCATENATE($B$2)","v":"1"},8,"2","09:00:00",5,"","10:40:00","11:10:00","00:30:00","Maks GERČAR",888,0,"L","Kristijan HAMZOVSKI",774,5,"W","F",true]
[5,"Kristijan HAMZOVSKI",null,null,null,null,"*",{"$f":"J8","v":5},{"$f":"IF(G10=\"*\",IF(AND(OFFSET(INDIRECT(G9),0,0)>0,NOT(ISNA(OFFSET(INDIRECT(G9),0,1)))),OFFSET(INDIRECT(G9),0,1),UnsetMatchCompetitorText),IF(OFFSET(INDIRECT(G9),2,5)>0,IF(COUNTIF(INDIRECT(G10),(OFFSET(INDIRECT(G9),0,5)))>0,OFFSET(INDIRECT(G9),0,1),IF(COUNTIF(INDIRECT(G10),(OFFSET(INDIRECT(G9),1,5)))>0,OFFSET(INDIRECT(G9),1,1),BlankMatchCompetitorText)),AwaitingMatchCompetitorText))","v":"Levin TKALČIČ"},null,null,null,null,{"$f":"IF(M10=NormalWinState,AND(M11=NormalLoseState,L10>L11),TRUE)","v":true},"*",{"$f":"R8","v":6},{"$f":"IF(O10=\"*\",IF(AND(OFFSET(INDIRECT(O9),0,0)>0,NOT(ISNA(OFFSET(INDIRECT(O9),0,1)))),OFFSET(INDIRECT(O9),0,1),UnsetMatchCompetitorText),IF(OFFSET(INDIRECT(O9),2,5)>0,IF(COUNTIF(INDIRECT(O10),(OFFSET(INDIRECT(O9),0,5)))>0,OFFSET(INDIRECT(O9),0,1),IF(COUNTIF(INDIRECT(O10),(OFFSET(INDIRECT(O9),1,5)))>0,OFFSET(INDIRECT(O9),1,1),BlankMatchCompetitorText)),AwaitingMatchCompetitorText))","v":""},null,null,null,null,{"$f":"IF(U10=NormalWinState,AND(U11=NormalLoseState,T10>T11),TRUE)","v":true},"*",{"$f":"Z8","v":7},{"$f":"IF(W10=\"*\",IF(AND(OFFSET(INDIRECT(W9),0,0)>0,NOT(ISNA(OFFSET(INDIRECT(W9),0,1)))),OFFSET(INDIRECT(W9),0,1),UnsetMatchCompetitorText),IF(OFFSET(INDIRECT(W9),2,5)>0,IF(COUNTIF(INDIRECT(W10),(OFFSET(INDIRECT(W9),0,5)))>0,OFFSET(INDIRECT(W9),0,1),IF(COUNTIF(INDIRECT(W10),(OFFSET(INDIRECT(W9),1,5)))>0,OFFSET(INDIRECT(W9),1,1),BlankMatchCompetitorText)),AwaitingMatchCompetitorText))","v":""},null,null,null,null,{"$f":"IF(AC10=NormalWinState,AND(AC11=NormalLoseState,AB10>AB11),TRUE)","v":true},"*",{"$f":"AH8","v":8},{"$f":"IF(AE10=\"*\",IF(AND(OFFSET(INDIRECT(AE9),0,0)>0,NOT(ISNA(OFFSET(INDIRECT(AE9),0,1)))),OFFSET(INDIRECT(AE9),0,1),UnsetMatchCompetitorText),IF(OFFSET(INDIRECT(AE9),2,5)>0,IF(COUNTIF(INDIRECT(AE10),(OFFSET(INDIRECT(AE9),0,5)))>0,OFFSET(INDIRECT(AE9),0,1),IF(COUNTIF(INDIRECT(AE10),(OFFSET(INDIRECT(AE9),1,5)))>0,OFFSET(INDIRECT(AE9),1,1),BlankMatchCompetitorText)),AwaitingMatchCompetitorText))","v":"Maks GERČAR"},null,null,0,"L",{"$f":"IF(AK10=NormalWinState,AND(AK11=NormalLoseState,AJ10>AJ11),TRUE)","v":true},null,null,null,null,null,null,null,null,null,null,null,null,null,null,null,null,"",{"$f":"IF(L6=FinishedMatchStates,1,0)+IF(T12=FinishedMatchStates,1,0)+IF(T18=FinishedMatchStates,1,0)+IF(AB24=FinishedMatchStates,1,0)+IF(AB30=FinishedMatchStates,1,0)+IF(AJ36=FinishedMatchStates,1,0)+IF(L42=FinishedMatchStates,1,0)","v":0},{"$f":"L5+T10+T17+AB22+AB29+AJ35+L40","v":0},{"$f":"L4+T11+T16+AB23+AB28+AJ34+L41","v":0},{"$f":"BE10-BF10","v":0},{"$f":"IF(COUNTIF(WinStates,M5),1,0)+IF(COUNTIF(WinStates,U10),1,0)+IF(COUNTIF(WinStates,U17),1,0)+IF(COUNTIF(WinStates,AC22),1,0)+IF(COUNTIF(WinStates,AC29),1,0)+IF(COUNTIF(WinStates,AK35),1,0)+IF(COUNTIF(WinStates,M40),1,0)","v":0},{"$f":"8-IF(BH10>=BH6,1,0)-IF(BH10>=BH7,1,0)-IF(BH10>=BH8,1,0)-IF(BH10>=BH9,1,0)-IF(BH10>=BH5,1,0)-IF(BH10>=BH11,1,0)-IF(BH10>=BH4,1,0)","v":5},null,null,null,null,0,"","",null,null,null,null,null,null,null,null,null,null,9,{"$f":"CB6+6","v":16},{"$f":"CC6","v":8},"$H$16","1",9,"1","09:00:00",5,"","10:19:00","11:35:00","01:16:00","Robert REDNAK",178,5,"W","Levin TKALČIČ",720,3,"L","F",true]
[6,"",null,null,null,null,{"$f":"CELL(\"address\",OFFSET($A$5,L8,0))","v":"$A$7"},null,{"$f":"IF(G12=\"*\",IF(AND(OFFSET(INDIRECT(G11),0,0)>0,NOT(ISNA(OFFSET(INDIRECT(G11),0,1)))),OFFSET(INDIRECT(G11),0,1),UnsetMatchCompetitorText),IF(OFFSET(INDIRECT(G11),2,5)>0,IF(COUNTIF(INDIRECT(G12),(OFFSET(INDIRECT(G11),0,5)))>0,OFFSET(INDIRECT(G11),0,1),IF(COUNTIF(INDIRECT(G12),(OFFSET(INDIRECT(G11),1,5)))>0,OFFSET(INDIRECT(G11),1,1),BlankMatchCompetitorText)),AwaitingMatchCompetitorText))","v":""},null,null,null,null,{"$f":"IF(M11=NormalWinState,AND(M10=NormalLoseState,L11>L10),TRUE)","v":true},{"$f":"CELL(\"address\",OFFSET($A$5,T8,0))","v":"$A$8"},null,{"$f":"IF(O12=\"*\",IF(AND(OFFSET(INDIRECT(O11),0,0)>0,NOT(ISNA(OFFSET(INDIRECT(O11),0,1)))),OFFSET(INDIRECT(O11),0,1),UnsetMatchCompetitorText),IF(OFFSET(INDIRECT(O11),2,5)>0,IF(COUNTIF(INDIRECT(O12),(OFFSET(INDIRECT(O11),0,5)))>0,OFFSET(INDIRECT(O11),0,1),IF(COUNTIF(INDIRECT(O12),(OFFSET(INDIRECT(O11),1,5)))>0,OFFSET(INDIRECT(O11),1,1),BlankMatchCompetitorText)),AwaitingMatchCompetitorText))","v":"Robert REDNAK"},null,null,null,null,{"$f":"IF(U11=NormalWinState,AND(U10=NormalLoseState,T11>T10),TRUE)","v":true},{"$f":"CELL(\"address\",OFFSET($A$5,AB8,0))","v":"$A$9"},null,{"$f":"IF(W12=\"*\",IF(AND(OFFSET(INDIRECT(W11),0,0)>0,NOT(ISNA(OFFSET(INDIRECT(W11),0,1)))),OFFSET(INDIRECT(W11),0,1),UnsetMatchCompetitorText),IF(OFFSET(INDIRECT(W11),2,5)>0,IF(COUNTIF(INDIRECT(W12),(OFFSET(INDIRECT(W11),0,5)))>0,OFFSET(INDIRECT(W11),0,1),IF(COUNTIF(INDIRECT(W12),(OFFSET(INDIRECT(W11),1,5)))>0,OFFSET(INDIRECT(W11),1,1),BlankMatchCompetitorText)),AwaitingMatchCompetitorText))","v":"Blaž KOLENC"},null,null,null,null,{"$f":"IF(AC11=NormalWinState,AND(AC10=NormalLoseState,AB11>AB10),TRUE)","v":true},{"$f":"CELL(\"address\",OFFSET($A$5,AJ8,0))","v":"$A$10"},null,{"$f":"IF(AE12=\"*\",IF(AND(OFFSET(INDIRECT(AE11),0,0)>0,NOT(ISNA(OFFSET(INDIRECT(AE11),0,1)))),OFFSET(INDIRECT(AE11),0,1),UnsetMatchCompetitorText),IF(OFFSET(INDIRECT(AE11),2,5)>0,IF(COUNTIF(INDIRECT(AE12),(OFFSET(INDIRECT(AE11),0,5)))>0,OFFSET(INDIRECT(AE11),0,1),IF(COUNTIF(INDIRECT(AE12),(OFFSET(INDIRECT(AE11),1,5)))>0,OFFSET(INDIRECT(AE11),1,1),BlankMatchCompetitorText)),AwaitingMatchCompetitorText))","v":"Kristijan HAMZOVSKI"},null,null,5,"W",{"$f":"IF(AK11=NormalWinState,AND(AK10=NormalLoseState,AJ11>AJ10),TRUE)","v":true},null,null,null,null,null,null,null,null,null,null,null,null,null,null,null,null,"Maks GERČAR",{"$f":"IF(AJ6=FinishedMatchStates,1,0)+IF(AJ12=FinishedMatchStates,1,0)+IF(AJ18=FinishedMatchStates,1,0)+IF(AJ24=FinishedMatchStates,1,0)+IF(AJ30=FinishedMatchStates,1,0)+IF(AJ36=FinishedMatchStates,1,0)+IF(AJ42=FinishedMatchStates,1,0)","v":4},{"$f":"AJ5+AJ10+AJ17+AJ22+AJ29+AJ34+AJ41","v":12},{"$f":"AJ4+AJ11+AJ16+AJ23+AJ28+AJ35+AJ40","v":17},{"$f":"BE11-BF11","v":-5},{"$f":"IF(COUNTIF(WinStates,AK5),1,0)+IF(COUNTIF(WinStates,AK10),1,0)+IF(COUNTIF(WinStates,AK17),1,0)+IF(COUNTIF(WinStates,AK22),1,0)+IF(COUNTIF(WinStates,AK29),1,0)+IF(COUNTIF(WinStates,AK34),1,0)+IF(COUNTIF(WinStates,AK41),1,0)","v":2},{"$f":"8-IF(BH11>=BH7,1,0)-IF(BH11>=BH8,1,0)-IF(BH11>=BH9,1,0)-IF(BH11>=BH10,1,0)-IF(BH11>=BH6,1,0)-IF(BH11>=BH4,1,0)-IF(BH11>=BH5,1,0)","v":2},null,null,null,null,0,"Maks GERČAR","",null,null,null,null,null,null,null,null,null,null,10,{"$f":"CB10","v":16},{"$f":"CC10+8","v":16},"$P$16",{"$f":"CONCATENATE($B$2)","v":"1"},10,"","09:00:00",0,"","00:00:00","00:00:00","","Blaž KOLENC",{"$f":"VLOOKUP(CN11,AnnouncementListCompetitors,6,FALSE)","v":683},0,0,"",{"$f":"VLOOKUP(CR11,AnnouncementListCompetitors,6,FALSE)","v":0},0,0,0,false]
[7,"",null,null,null,null,"*",null,null,null,{"$f":"IF(ISBLANK(I12),\"\",IF(ISBLANK(J12),CurrentTime-I12,J12-I12))","v":""},null,{"$f":"IF(AND(COUNTIF(FinishedMatchStates,L12),NOT(ISNA(VLOOKUP(M10,MatchCompetitorStateCodes,1,FALSE))),NOT(ISNA(VLOOKUP(M11,MatchCompetitorStateCodes,1,FALSE))),COUNTIF(WinStates,M10)+COUNTIF(WinStates,M11)<=1,COUNTIF(LoseStates,M10)+COUNTIF(LoseStates,M11)<=1,IF(M10=NormalWinState,AND(M11=NormalLoseState,L10>L11),TRUE),IF(M11=NormalWinState,AND(M10=NormalLoseState,L11>L10),TRUE),NOT(ISBLANK(L9)),NOT(ISBLANK(I9)),NOT(ISBLANK(I12)),NOT(ISBLANK(J12)),H9>0),1,IF(COUNTIF(FinishedMatchStates,L12)>0,-1,0))","v":0},null,"*",null,null,null,{"$f":"IF(ISBLANK(Q12),\"\",IF(ISBLANK(R12),CurrentTime-Q12,R12-Q12))","v":""},null,{"$f":"IF(AND(COUNTIF(FinishedMatchStates,T12),NOT(ISNA(VLOOKUP(U10,MatchCompetitorStateCodes,1,FALSE))),NOT(ISNA(VLOOKUP(U11,MatchCompetitorStateCodes,1,FALSE))),COUNTIF(WinStates,U10)+COUNTIF(WinStates,U11)<=1,COUNTIF(LoseStates,U10)+COUNTIF(LoseStates,U11)<=1,IF(U10=NormalWinState,AND(U11=NormalLoseState,T10>T11),TRUE),IF(U11=NormalWinState,AND(U10=NormalLoseState,T11>T10),TRUE),NOT(ISBLANK(T9)),NOT(ISBLANK(Q9)),NOT(ISBLANK(Q12)),NOT(ISBLANK(R12)),P9>0),1,IF(COUNTIF(FinishedMatchStates,T12)>0,-1,0))","v":0},null,"*",null,null,null,{"$f":"IF(ISBLANK(Y12),\"\",IF(ISBLANK(Z12),CurrentTime-Y12,Z12-Y12))","v":""},null,{"$f":"IF(AND(COUNTIF(FinishedMatchStates,AB12),NOT(ISNA(VLOOKUP(AC10,MatchCompetitorStateCodes,1,FALSE))),NOT(ISNA(VLOOKUP(AC11,MatchCompetitorStateCodes,1,FALSE))),COUNTIF(WinStates,AC10)+COUNTIF(WinStates,AC11)<=1,COUNTIF(LoseStates,AC10)+COUNTIF(LoseStates,AC11)<=1,IF(AC10=NormalWinState,AND(AC11=NormalLoseState,AB10>AB11),TRUE),IF(AC11=NormalWinState,AND(AC10=NormalLoseState,AB11>AB10),TRUE),NOT(ISBLANK(AB9)),NOT(ISBLANK(Y9)),NOT(ISBLANK(Y12)),NOT(ISBLANK(Z12)),X9>0),1,IF(COUNTIF(FinishedMatchStates,AB12)>0,-1,0))","v":0},null,"*",2,"10:40:00","11:10:00",{"$f":"IF(ISBLANK(AG12),\"\",IF(ISBLANK(AH12),CurrentTime-AG12,AH12-AG12))","v":"00:30:00"},"F",{"$f":"IF(AND(COUNTIF(FinishedMatchStates,AJ12),NOT(ISNA(VLOOKUP(AK10,MatchCompetitorStateCodes,1,FALSE))),NOT(ISNA(VLOOKUP(AK11,MatchCompetitorStateCodes,1,FALSE))),COUNTIF(WinStates,AK10)+COUNTIF(WinStates,AK11)<=1,COUNTIF(LoseStates,AK10)+COUNTIF(LoseStates,AK11)<=1,IF(AK10=NormalWinState,AND(AK11=NormalLoseState,AJ10>AJ11),TRUE),IF(AK11=NormalWinState,AND(AK10=NormalLoseState,AJ11>AJ10),TRUE),NOT(ISBLANK(AJ9)),NOT(ISBLANK(AG9)),NOT(ISBLANK(AG12)),NOT(ISBLANK(AH12)),AF9>0),1,IF(COUNTIF(FinishedMatchStates,AJ12)>0,-1,0))","v":1},null,null,null,null,null,null,null,null,null,null,null,null,null,null,null,null,null,null,null,null,null,null,null,null,null,null,null,null,null,null,null,null,null,null,null,null,null,null,null,null,null,11,{"$f":"CB11","v":16},{"$f":"CC11+8","v":24},"$X$16",{"$f":"CONCATENATE($B$2)","v":"1"},11,"","09:00:00",0,"","00:00:00","00:00:00","","Kristijan HAMZOVSKI",774,0,0,"",0,0,0,0,false]
[8,"Maks GERČAR",null,null,null,null,null,null,null,null,null,null,null,null,null,null,null,null,null,null,null,null,null,null,null,null,null,null,null,null,null,null,null,null,null,null,null,null,null,null,null,null,null,null,null,null,null,null,null,null,null,null,null,null,null,null,null,null,null,null,null,null,null,null,null,null,null,null,null,null,null,null,null,null,null,null,null,null,12,{"$f":"CB12","v":16},{"$f":"CC12+8","v":32},"$AF$16",{"$f":"CONCATENATE($B$2)","v":"1"},12,"","09:00:00",0,"","00:00:00","00:00:00","","",0,0,0,"Maks GERČAR",888,0,0,0,false]
[null,null,null,null,null,null,{"$f":"G8","v":1},{"$f":"H8+1","v":3},{"$f":"I8","v":1},{"$f":"((H14-1)*$B$3)+I14","v":9},3,1,null,null,{"$f":"G14","v":1},{"$f":"H14","v":3},{"$f":"I14+1","v":2},{"$f":"((P14-1)*$B$3)+Q14","v":10},4,7,null,null,{"$f":"O14","v":1},{"$f":"P14","v":3},{"$f":"Q14+1","v":3},{"$f":"((X14-1)*$B$3)+Y14","v":11},5,6,null,null,{"$f":"W14","v":1},{"$f":"X14","v":3},{"$f":"Y14+1","v":4},{"$f":"((AF14-1)*$B$3)+AG14","v":12},2,8,null,null,null,null,null,null,null,null,null,null,null,null,null,null,null,null,null,null,null,null,null,null,null,null,null,null,null,null,null,null,null,null,null,null,null,null,null,null,null,null,null,null,13,{"$f":"CB10+6","v":22},{"$f":"CC10","v":8},"$H$22","1",13,"1","09:00:00",5,"","11:11:00","12:43:00","01:32:00","Levin TKALČIČ",720,3,"L","Blaž KOLENC",683,5,"W","F",true]
["Uvr.","Tekmovalec","Poz.","P",null,null,{"$f":"CELL(\"address\",OFFSET($A$5,K14,0))","v":"$A$8"},{"$f":"IF(AND(NOT(ISBLANK(I16)),I16<>UnsetMatchCompetitorText,I16<>AwaitingMatchCompetitorText,NOT(ISBLANK(I17)),I17<>UnsetMatchCompetitorText,I17<>AwaitingMatchCompetitorText),1,IF(AND(I16<>AwaitingMatchCompetitorText,I17<>AwaitingMatchCompetitorText),-1,0))","v":1},"09:00:00",null,null,5,null,null,{"$f":"CELL(\"address\",OFFSET($A$5,S14,0))","v":"$A$9"},{"$f":"IF(AND(NOT(ISBLANK(Q16)),Q16<>UnsetMatchCompetitorText,Q16<>AwaitingMatchCompetitorText,NOT(ISBLANK(Q17)),Q17<>UnsetMatchCompetitorText,Q17<>AwaitingMatchCompetitorText),1,IF(AND(Q16<>AwaitingMatchCompetitorText,Q17<>AwaitingMatchCompetitorText),-1,0))","v":1},"09:00:00",null,null,null,null,null,{"$f":"CELL(\"address\",OFFSET($A$5,AA14,0))","v":"$A$10"},{"$f":"IF(AND(NOT(ISBLANK(Y16)),Y16<>UnsetMatchCompetitorText,Y16<>AwaitingMatchCompetitorText,NOT(ISBLANK(Y17)),Y17<>UnsetMatchCompetitorText,Y17<>AwaitingMatchCompetitorText),1,IF(AND(Y16<>AwaitingMatchCompetitorText,Y17<>AwaitingMatchCompetitorText),-1,0))","v":1},"09:00:00",null,null,null,null,null,{"$f":"CELL(\"address\",OFFSET($A$5,AI14,0))","v":"$A$7"},{"$f":"IF(AND(NOT(ISBLANK(AG16)),AG16<>UnsetMatchCompetitorText,AG16<>AwaitingMatchCompetitorText,NOT(ISBLANK(AG17)),AG17<>UnsetMatchCompetitorText,AG17<>AwaitingMatchCompetitorText),1,IF(AND(AG16<>AwaitingMatchCompetitorText,AG17<>AwaitingMatchCompetitorText),-1,0))","v":1},"09:00:00",null,null,null,null,null,null,null,null,null,null,null,null,null,null,null,null,null,null,null,null,null,null,null,null,null,null,null,null,null,null,null,null,null,null,null,null,null,null,null,null,null,null,null,null,null,14,{"$f":"CB14","v":22},{"$f":"CC14+8","v":16},"$P$22",{"$f":"CONCATENATE($B$2)","v":"1"},14,"","09:00:00",0,"","00:00:00","00:00:00","","",0,0,0,"Robert REDNAK",178,0,0,0,false]
["Q",{"$f":"VLOOKUP(D16,BN$4:BP$11,2,)","v":"Kristijan HAMZOVSKI"},{"$f":"VLOOKUP(D16,BN$4:BP$11,3,)","v":""},1,null,null,"*",{"$f":"J14","v":9},{"$f":"IF(G16=\"*\",IF(AND(OFFSET(INDIRECT(G15),0,0)>0,NOT(ISNA(OFFSET(INDIRECT(G15),0,1)))),OFFSET(INDIRECT(G15),0,1),UnsetMatchCompetitorText),IF(OFFSET(INDIRECT(G15),2,5)>0,IF(COUNTIF(INDIRECT(G16),(OFFSET(INDIRECT(G15),0,5)))>0,OFFSET(INDIRECT(G15),0,1),IF(COUNTIF(INDIRECT(G16),(OFFSET(INDIRECT(G15),1,5)))>0,OFFSET(INDIRECT(G15),1,1),BlankMatchCompetitorText)),AwaitingMatchCompetitorText))","v":"Robert REDNAK"},null,null,5,"W",{"$f":"IF(M16=NormalWinState,AND(M17=NormalLoseState,L16>L17),TRUE)","v":true},"*",{"$f":"R14","v":10},{"$f":"IF(O16=\"*\",IF(AND(OFFSET(INDIRECT(O15),0,0)>0,NOT(ISNA(OFFSET(INDIRECT(O15),0,1)))),OFFSET(INDIRECT(O15),0,1),UnsetMatchCompetitorText),IF(OFFSET(INDIRECT(O15),2,5)>0,IF(COUNTIF(INDIRECT(O16),(OFFSET(INDIRECT(O15),0,5)))>0,OFFSET(INDIRECT(O15),0,1),IF(COUNTIF(INDIRECT(O16),(OFFSET(INDIRECT(O15),1,5)))>0,OFFSET(INDIRECT(O15),1,1),BlankMatchCompetitorText)),AwaitingMatchCompetitorText))","v":"Blaž KOLENC"},null,null,null,null,{"$f":"IF(U16=NormalWinState,AND(U17=NormalLoseState,T16>T17),TRUE)","v":true},"*",{"$f":"Z14","v":11},{"$f":"IF(W16=\"*\",IF(AND(OFFSET(INDIRECT(W15),0,0)>0,NOT(ISNA(OFFSET(INDIRECT(W15),0,1)))),OFFSET(INDIRECT(W15),0,1),UnsetMatchCompetitorText),IF(OFFSET(INDIRECT(W15),2,5)>0,IF(COUNTIF(INDIRECT(W16),(OFFSET(INDIRECT(W15),0,5)))>0,OFFSET(INDIRECT(W15),0,1),IF(COUNTIF(INDIRECT(W16),(OFFSET(INDIRECT(W15),1,5)))>0,OFFSET(INDIRECT(W15),1,1),BlankMatchCompetitorText)),AwaitingMatchCompetitorText))","v":"Kristijan HAMZOVSKI"},null,null,null,null,{"$f":"IF(AC16=NormalWinState,AND(AC17=NormalLoseState,AB16>AB17),TRUE)","v":true},"*",{"$f":"AH14","v":12},{"$f":"IF(AE16=\"*\",IF(AND(OFFSET(INDIRECT(AE15),0,0)>0,NOT(ISNA(OFFSET(INDIRECT(AE15),0,1)))),OFFSET(INDIRECT(AE15),0,1),UnsetMatchCompetitorText),IF(OFFSET(INDIRECT(AE15),2,5)>0,IF(COUNTIF(INDIRECT(AE16),(OFFSET(INDIRECT(AE15),0,5)))>0,OFFSET(INDIRECT(AE15),0,1),IF(COUNTIF(INDIRECT(AE16),(OFFSET(INDIRECT(AE15),1,5)))>0,OFFSET(INDIRECT(AE15),1,1),BlankMatchCompetitorText)),AwaitingMatchCompetitorText))","v":""},null,null,null,null,{"$f":"IF(AK16=NormalWinState,AND(AK17=NormalLoseState,AJ16>AJ17),TRUE)","v":true},null,null,null,null,null,null,null,null,null,null,null,null,null,null,null,null,null,null,null,null,null,null,null,null,null,null,null,null,null,null,null,null,null,null,null,null,null,null,null,null,15,{"$f":"CB15","v":22},{"$f":"CC15+8","v":24},"$X$22",{"$f":"CONCATENATE($B$2)","v":"1"},15,"","09:00:00",0,"","00:00:00","00:00:00","","",0,0,0,"Kristijan HAMZOVSKI",774,0,0,0,false]
["Q",{"$f":"VLOOKUP(D17,BN$4:BP$11,2,)","v":"Robert REDNAK"},{"$f":"VLOOKUP(D17,BN$4:BP$11,3,)","v":""},2,null,null,{"$f":"CELL(\"address\",OFFSET($A$5,L14,0))","v":"$A$6"},null,{"$f":"IF(G18=\"*\",IF(AND(OFFSET(INDIRECT(G17),0,0)>0,NOT(ISNA(OFFSET(INDIRECT(G17),0,1)))),OFFSET(INDIRECT(G17),0,1),UnsetMatchCompetitorText),IF(OFFSET(INDIRECT(G17),2,5)>0,IF(COUNTIF(INDIRECT(G18),(OFFSET(INDIRECT(G17),0,5)))>0,OFFSET(INDIRECT(G17),0,1),IF(COUNTIF(INDIRECT(G18),(OFFSET(INDIRECT(G17),1,5)))>0,OFFSET(INDIRECT(G17),1,1),BlankMatchCompetitorText)),AwaitingMatchCompetitorText))","v":"Levin TKALČIČ"},null,null,3,"L",{"$f":"IF(M17=NormalWinState,AND(M16=NormalLoseState,L17>L16),TRUE)","v":true},{"$f":"CELL(\"address\",OFFSET($A$5,T14,0))","v":"$A$12"},null,{"$f":"IF(O18=\"*\",IF(AND(OFFSET(INDIRECT(O17),0,0)>0,NOT(ISNA(OFFSET(INDIRECT(O17),0,1)))),OFFSET(INDIRECT(O17),0,1),UnsetMatchCompetitorText),IF(OFFSET(INDIRECT(O17),2,5)>0,IF(COUNTIF(INDIRECT(O18),(OFFSET(INDIRECT(O17),0,5)))>0,OFFSET(INDIRECT(O17),0,1),IF(COUNTIF(INDIRECT(O18),(OFFSET(INDIRECT(O17),1,5)))>0,OFFSET(INDIRECT(O17),1,1),BlankMatchCompetitorText)),AwaitingMatchCompetitorText))","v":""},null,null,null,null,{"$f":"IF(U17=NormalWinState,AND(U16=NormalLoseState,T17>T16),TRUE)","v":true},{"$f":"CELL(\"address\",OFFSET($A$5,AB14,0))","v":"$A$11"},null,{"$f":"IF(W18=\"*\",IF(AND(OFFSET(INDIRECT(W17),0,0)>0,NOT(ISNA(OFFSET(INDIRECT(W17),0,1)))),OFFSET(INDIRECT(W17),0,1),UnsetMatchCompetitorText),IF(OFFSET(INDIRECT(W17),2,5)>0,IF(COUNTIF(INDIRECT(W18),(OFFSET(INDIRECT(W17),0,5)))>0,OFFSET(INDIRECT(W17),0,1),IF(COUNTIF(INDIRECT(W18),(OFFSET(INDIRECT(W17),1,5)))>0,OFFSET(INDIRECT(W17),1,1),BlankMatchCompetitorText)),AwaitingMatchCompetitorText))","v":""},null,null,null,null,{"$f":"IF(AC17=NormalWinState,AND(AC16=NormalLoseState,AB17>AB16),TRUE)","v":true},{"$f":"CELL(\"address\",OFFSET($A$5,AJ14,0))","v":"$A$13"},null,{"$f":"IF(AE18=\"*\",IF(AND(OFFSET(INDIRECT(AE17),0,0)>0,NOT(ISNA(OFFSET(INDIRECT(AE17),0,1)))),OFFSET(INDIRECT(AE17),0,1),UnsetMatchCompetitorText),IF(OFFSET(INDIRECT(AE17),2,5)>0,IF(COUNTIF(INDIRECT(AE18),(OFFSET(INDIRECT(AE17),0,5)))>0,OFFSET(INDIRECT(AE17),0,1),IF(COUNTIF(INDIRECT(AE18),(OFFSET(INDIRECT(AE17),1,5)))>0,OFFSET(INDIRECT(AE17),1,1),BlankMatchCompetitorText)),AwaitingMatchCompetitorText))","v":"Maks GERČAR"},null,null,null,null,{"$f":"IF(AK17=NormalWinState,AND(AK16=NormalLoseState,AJ17>AJ16),TRUE)","v":true},null,null,null,null,null,null,null,null,null,null,null,null,null,null,null,null,null,null,null,null,null,null,null,null,null,null,null,null,null,null,null,null,null,null,null,null,null,null,null,null,16,{"$f":"CB16","v":22},{"$f":"CC16+8","v":32},"$AF$22",{"$f":"CONCATENATE($B$2)","v":"1"},16,"","09:00:00",0,"","00:00:00","00:00:00","","Maks GERČAR",888,0,0,"",0,0,0,0,false]
[{"$f":"A19-TournamentGroupCount","v":17},{"$error":"#N/A"},{"$error":"#N/A"},3,null,null,"*",1,"10:19:00","11:35:00",{"$f":"IF(ISBLANK(I18),\"\",IF(ISBLANK(J18),CurrentTime-I18,J18-I18))","v":"01:16:00"},"F",{"$f":"IF(AND(COUNTIF(FinishedMatchStates,L18),NOT(ISNA(VLOOKUP(M16,MatchCompetitorStateCodes,1,FALSE))),NOT(ISNA(VLOOKUP(M17,MatchCompetitorStateCodes,1,FALSE))),COUNTIF(WinStates,M16)+COUNTIF(WinStates,M17)<=1,COUNTIF(LoseStates,M16)+COUNTIF(LoseStates,M17)<=1,IF(M16=NormalWinState,AND(M17=NormalLoseState,L16>L17),TRUE),IF(M17=NormalWinState,AND(M16=NormalLoseState,L17>L16),TRUE),NOT(ISBLANK(L15)),NOT(ISBLANK(I15)),NOT(ISBLANK(I18)),NOT(ISBLANK(J18)),H15>0),1,IF(COUNTIF(FinishedMatchStates,L18)>0,-1,0))","v":1},null,"*",null,null,null,{"$f":"IF(ISBLANK(Q18),\"\",IF(ISBLANK(R18),CurrentTime-Q18,R18-Q18))","v":""},null,{"$f":"IF(AND(COUNTIF(FinishedMatchStates,T18),NOT(ISNA(VLOOKUP(U16,MatchCompetitorStateCodes,1,FALSE))),NOT(ISNA(VLOOKUP(U17,MatchCompetitorStateCodes,1,FALSE))),COUNTIF(WinStates,U16)+COUNTIF(WinStates,U17)<=1,COUNTIF(LoseStates,U16)+COUNTIF(LoseStates,U17)<=1,IF(U16=NormalWinState,AND(U17=NormalLoseState,T16>T17),TRUE),IF(U17=NormalWinState,AND(U16=NormalLoseState,T17>T16),TRUE),NOT(ISBLANK(T15)),NOT(ISBLANK(Q15)),NOT(ISBLANK(Q18)),NOT(ISBLANK(R18)),P15>0),1,IF(COUNTIF(FinishedMatchStates,T18)>0,-1,0))","v":0},null,"*",null,null,null,{"$f":"IF(ISBLANK(Y18),\"\",IF(ISBLANK(Z18),CurrentTime-Y18,Z18-Y18))","v":""},null,{"$f":"IF(AND(COUNTIF(FinishedMatchStates,AB18),NOT(ISNA(VLOOKUP(AC16,MatchCompetitorStateCodes,1,FALSE))),NOT(ISNA(VLOOKUP(AC17,MatchCompetitorStateCodes,1,FALSE))),COUNTIF(WinStates,AC16)+COUNTIF(WinStates,AC17)<=1,COUNTIF(LoseStates,AC16)+COUNTIF(LoseStates,AC17)<=1,IF(AC16=NormalWinState,AND(AC17=NormalLoseState,AB16>AB17),TRUE),IF(AC17=NormalWinState,AND(AC16=NormalLoseState,AB17>AB16),TRUE),NOT(ISBLANK(AB15)),NOT(ISBLANK(Y15)),NOT(ISBLANK(Y18)),NOT(ISBLANK(Z18)),X15>0),1,IF(COUNTIF(FinishedMatchStates,AB18)>0,-1,0))","v":0},null,"*",null,null,null,{"$f":"IF(ISBLANK(AG18),\"\",IF(ISBLANK(AH18),CurrentTime-AG18,AH18-AG18))","v":""},null,{"$f":"IF(AND(COUNTIF(FinishedMatchStates,AJ18),NOT(ISNA(VLOOKUP(AK16,MatchCompetitorStateCodes,1,FALSE))),NOT(ISNA(VLOOKUP(AK17,MatchCompetitorStateCodes,1,FALSE))),COUNTIF(WinStates,AK16)+COUNTIF(WinStates,AK17)<=1,COUNTIF(LoseStates,AK16)+COUNTIF(LoseStates,AK17)<=1,IF(AK16=NormalWinState,AND(AK17=NormalLoseState,AJ16>AJ17),TRUE),IF(AK17=NormalWinState,AND(AK16=NormalLoseState,AJ17>AJ16),TRUE),NOT(ISBLANK(AJ15)),NOT(ISBLANK(AG15)),NOT(ISBLANK(AG18)),NOT(ISBLANK(AH18)),AF15>0),1,IF(COUNTIF(FinishedMatchStates,AJ18)>0,-1,0))","v":0},null,null,null,null,null,null,null,null,null,null,null,null,null,null,null,null,null,null,null,null,null,null,null,null,null,null,null,null,null,null,null,null,null,null,null,null,null,null,null,null,null,17,{"$f":"CB14+6","v":28},{"$f":"CC14","v":8},"$H$28","1",17,"1","09:00:00",5,"","12:43:00","13:33:00","00:50:00","Kristijan HAMZOVSKI",774,5,"W","Levin TKALČIČ",720,1,"L","F",true]
[{"$f":"A20-TournamentGroupCount","v":21},{"$error":"#N/A"},{"$error":"#N/A"},4,null,null,null,null,null,null,null,null,null,null,null,null,null,null,null,null,null,null,null,null,null,null,null,null,null,null,null,null,null,null,null,null,null,null,null,null,null,null,null,null,null,null,null,null,null,null,null,null,null,null,null,null,null,null,null,null,null,null,null,null,null,null,null,null,null,null,null,null,null,null,null,null,null,null,18,{"$f":"CB18","v":28},{"$f":"CC18+8","v":16},"$P$28",{"$f":"CONCATENATE($B$2)","v":"1"},18,"","09:00:00",0,"","00:00:00","00:00:00","","Blaž KOLENC",{"$f":"VLOOKUP(CN19,AnnouncementListCompetitors,6,FALSE)","v":683},0,0,"",{"$f":"VLOOKUP(CR19,AnnouncementListCompetitors,6,FALSE)","v":0},0,0,0,false]
[{"$f":"A21-TournamentGroupCount","v":25},{"$error":"#N/A"},{"$error":"#N/A"},5,null,null,{"$f":"G14","v":1},{"$f":"H14+1","v":4},{"$f":"I14","v":1},{"$f":"((H20-1)*$B$3)+I20","v":13},1,4,null,null,{"$f":"G20","v":1},{"$f":"H20","v":4},{"$f":"I20+1","v":2},{"$f":"((P20-1)*$B$3)+Q20","v":14},2,3,null,null,{"$f":"O20","v":1},{"$f":"P20","v":4},{"$f":"Q20+1","v":3},{"$f":"((X20-1)*$B$3)+Y20","v":15},7,5,null,null,{"$f":"W20","v":1},{"$f":"X20","v":4},{"$f":"Y20+1","v":4},{"$f":"((AF20-1)*$B$3)+AG20","v":16},8,6,null,null,null,null,null,null,null,null,null,null,null,null,null,null,null,null,null,null,null,null,null,null,null,null,null,null,null,null,null,null,null,null,null,null,null,null,null,null,null,null,null,null,19,{"$f":"CB19","v":28},{"$f":"CC19+8","v":24},"$X$28",{"$f":"CONCATENATE($B$2)","v":"1"},19,"","09:00:00",0,"","00:00:00","00:00:00","","",0,0,0,"",0,0,0,0,false]
[{"$f":"A22-TournamentGroupCount","v":29},{"$error":"#N/A"},{"$error":"#N/A"},6,null,null,{"$f":"CELL(\"address\",OFFSET($A$5,K20,0))","v":"$A$6"},{"$f":"IF(AND(NOT(ISBLANK(I22)),I22<>UnsetMatchCompetitorText,I22<>AwaitingMatchCompetitorText,NOT(ISBLANK(I23)),I23<>UnsetMatchCompetitorText,I23<>AwaitingMatchCompetitorText),1,IF(AND(I22<>AwaitingMatchCompetitorText,I23<>AwaitingMatchCompetitorText),-1,0))","v":1},"09:00:00",null,null,5,null,null,{"$f":"CELL(\"address\",OFFSET($A$5,S20,0))","v":"$A$7"},{"$f":"IF(AND(NOT(ISBLANK(Q22)),Q22<>UnsetMatchCompetitorText,Q22<>AwaitingMatchCompetitorText,NOT(ISBLANK(Q23)),Q23<>UnsetMatchCompetitorText,Q23<>AwaitingMatchCompetitorText),1,IF(AND(Q22<>AwaitingMatchCompetitorText,Q23<>AwaitingMatchCompetitorText),-1,0))","v":1},"09:00:00",null,null,null,null,null,{"$f":"CELL(\"address\",OFFSET($A$5,AA20,0))","v":"$A$12"},{"$f":"IF(AND(NOT(ISBLANK(Y22)),Y22<>UnsetMatchCompetitorText,Y22<>AwaitingMatchCompetitorText,NOT(ISBLANK(Y23)),Y23<>UnsetMatchCompetitorText,Y23<>AwaitingMatchCompetitorText),1,IF(AND(Y22<>AwaitingMatchCompetitorText,Y23<>AwaitingMatchCompetitorText),-1,0))","v":1},"09:00:00",null,null,null,null,null,{"$f":"CELL(\"address\",OFFSET($A$5,AI20,0))","v":"$A$13"},{"$f":"IF(AND(NOT(ISBLANK(AG22)),AG22<>UnsetMatchCompetitorText,AG22<>AwaitingMatchCompetitorText,NOT(ISBLANK(AG23)),AG23<>UnsetMatchCompetitorText,AG23<>AwaitingMatchCompetitorText),1,IF(AND(AG22<>AwaitingMatchCompetitorText,AG23<>AwaitingMatchCompetitorText),-1,0))","v":1},"09:00:00",null,null,null,null,null,null,null,null,null,null,null,null,null,null,null,null,null,null,null,null,null,null,null,null,null,null,null,null,null,null,null,null,null,null,null,null,null,null,null,null,null,null,null,null,null,20,{"$f":"CB20","v":28},{"$f":"CC20+8","v":32},"$AF$28",{"$f":"CONCATENATE($B$2)","v":"1"},20,"6","09:00:00",5,"","12:39:00","13:43:00","01:04:00","Robert REDNAK",178,4,"L","Maks GERČAR",888,5,"W","F",true]
[{"$f":"A23-TournamentGroupCount","v":33},{"$error":"#N/A"},{"$error":"#N/A"},7,null,null,"*",{"$f":"J20","v":13},{"$f":"IF(G22=\"*\",IF(AND(OFFSET(INDIRECT(G21),0,0)>0,NOT(ISNA(OFFSET(INDIRECT(G21),0,1)))),OFFSET(INDIRECT(G21),0,1),UnsetMatchCompetitorText),IF(OFFSET(INDIRECT(G21),2,5)>0,IF(COUNTIF(INDIRECT(G22),(OFFSET(INDIRECT(G21),0,5)))>0,OFFSET(INDIRECT(G21),0,1),IF(COUNTIF(INDIRECT(G22),(OFFSET(INDIRECT(G21),1,5)))>0,OFFSET(INDIRECT(G21),1,1),BlankMatchCompetitorText)),AwaitingMatchCompetitorText))","v":"Levin TKALČIČ"},null,null,3,"L",{"$f":"IF(M22=NormalWinState,AND(M23=NormalLoseState,L22>L23),TRUE)","v":true},"*",{"$f":"R20","v":14},{"$f":"IF(O22=\"*\",IF(AND(OFFSET(INDIRECT(O21),0,0)>0,NOT(ISNA(OFFSET(INDIRECT(O21),0,1)))),OFFSET(INDIRECT(O21),0,1),UnsetMatchCompetitorText),IF(OFFSET(INDIRECT(O21),2,5)>0,IF(COUNTIF(INDIRECT(O22),(OFFSET(INDIRECT(O21),0,5)))>0,OFFSET(INDIRECT(O21),0,1),IF(COUNTIF(INDIRECT(O22),(OFFSET(INDIRECT(O21),1,5)))>0,OFFSET(INDIRECT(O21),1,1),BlankMatchCompetitorText)),AwaitingMatchCompetitorText))","v":""},null,null,null,null,{"$f":"IF(U22=NormalWinState,AND(U23=NormalLoseState,T22>T23),TRUE)","v":true},"*",{"$f":"Z20","v":15},{"$f":"IF(W22=\"*\",IF(AND(OFFSET(INDIRECT(W21),0,0)>0,NOT(ISNA(OFFSET(INDIRECT(W21),0,1)))),OFFSET(INDIRECT(W21),0,1),UnsetMatchCompetitorText),IF(OFFSET(INDIRECT(W21),2,5)>0,IF(COUNTIF(INDIRECT(W22),(OFFSET(INDIRECT(W21),0,5)))>0,OFFSET(INDIRECT(W21),0,1),IF(COUNTIF(INDIRECT(W22),(OFFSET(INDIRECT(W21),1,5)))>0,OFFSET(INDIRECT(W21),1,1),BlankMatchCompetitorText)),AwaitingMatchCompetitorText))","v":""},null,null,null,null,{"$f":"IF(AC22=NormalWinState,AND(AC23=NormalLoseState,AB22>AB23),TRUE)","v":true},"*",{"$f":"AH20","v":16},{"$f":"IF(AE22=\"*\",IF(AND(OFFSET(INDIRECT(AE21),0,0)>0,NOT(ISNA(OFFSET(INDIRECT(AE21),0,1)))),OFFSET(INDIRECT(AE21),0,1),UnsetMatchCompetitorText),IF(OFFSET(INDIRECT(AE21),2,5)>0,IF(COUNTIF(INDIRECT(AE22),(OFFSET(INDIRECT(AE21),0,5)))>0,OFFSET(INDIRECT(AE21),0,1),IF(COUNTIF(INDIRECT(AE22),(OFFSET(INDIRECT(AE21),1,5)))>0,OFFSET(INDIRECT(AE21),1,1),BlankMatchCompetitorText)),AwaitingMatchCompetitorText))","v":"Maks GERČAR"},null,null,null,null,{"$f":"IF(AK22=NormalWinState,AND(AK23=NormalLoseState,AJ22>AJ23),TRUE)","v":true},null,null,null,null,null,null,null,null,null,null,null,null,null,null,null,null,null,null,null,null,null,null,null,null,null,null,null,null,null,null,null,null,null,null,null,null,null,null,null,null,21,{"$f":"CB18+6","v":34},{"$f":"CC18","v":8},"$H$34","1",21,"","09:00:00",0,"","00:00:00","00:00:00","","Levin TKALČIČ",720,0,0,"",0,0,0,0,false]
[{"$f":"TournamentSize-TournamentGroupCount+1","v":37},{"$error":"#N/A"},{"$error":"#N/A"},8,null,null,{"$f":"CELL(\"address\",OFFSET($A$5,L20,0))","v":"$A$9"},null,{"$f":"IF(G24=\"*\",IF(AND(OFFSET(INDIRECT(G23),0,0)>0,NOT(ISNA(OFFSET(INDIRECT(G23),0,1)))),OFFSET(INDIRECT(G23),0,1),UnsetMatchCompetitorText),IF(OFFSET(INDIRECT(G23),2,5)>0,IF(COUNTIF(INDIRECT(G24),(OFFSET(INDIRECT(G23),0,5)))>0,OFFSET(INDIRECT(G23),0,1),IF(COUNTIF(INDIRECT(G24),(OFFSET(INDIRECT(G23),1,5)))>0,OFFSET(INDIRECT(G23),1,1),BlankMatchCompetitorText)),AwaitingMatchCompetitorText))","v":"Blaž KOLENC"},null,null,5,"W",{"$f":"IF(M23=NormalWinState,AND(M22=NormalLoseState,L23>L22),TRUE)","v":true},{"$f":"CELL(\"address\",OFFSET($A$5,T20,0))","v":"$A$8"},null,{"$f":"IF(O24=\"*\",IF(AND(OFFSET(INDIRECT(O23),0,0)>0,NOT(ISNA(OFFSET(INDIRECT(O23),0,1)))),OFFSET(INDIRECT(O23),0,1),UnsetMatchCompetitorText),IF(OFFSET(INDIRECT(O23),2,5)>0,IF(COUNTIF(INDIRECT(O24),(OFFSET(INDIRECT(O23),0,5)))>0,OFFSET(INDIRECT(O23),0,1),IF(COUNTIF(INDIRECT(O24),(OFFSET(INDIRECT(O23),1,5)))>0,OFFSET(INDIRECT(O23),1,1),BlankMatchCompetitorText)),AwaitingMatchCompetitorText))","v":"Robert REDNAK"},null,null,null,null,{"$f":"IF(U23=NormalWinState,AND(U22=NormalLoseState,T23>T22),TRUE)","v":true},{"$f":"CELL(\"address\",OFFSET($A$5,AB20,0))","v":"$A$10"},null,{"$f":"IF(W24=\"*\",IF(AND(OFFSET(INDIRECT(W23),0,0)>0,NOT(ISNA(OFFSET(INDIRECT(W23),0,1)))),OFFSET(INDIRECT(W23),0,1),UnsetMatchCompetitorText),IF(OFFSET(INDIRECT(W23),2,5)>0,IF(COUNTIF(INDIRECT(W24),(OFFSET(INDIRECT(W23),0,5)))>0,OFFSET(INDIRECT(W23),0,1),IF(COUNTIF(INDIRECT(W24),(OFFSET(INDIRECT(W23),1,5)))>0,OFFSET(INDIRECT(W23),1,1),BlankMatchCompetitorText)),AwaitingMatchCompetitorText))","v":"Kristijan HAMZOVSKI"},null,null,null,null,{"$f":"IF(AC23=NormalWinState,AND(AC22=NormalLoseState,AB23>AB22),TRUE)","v":true},{"$f":"CELL(\"address\",OFFSET($A$5,AJ20,0))","v":"$A$11"},null,{"$f":"IF(AE24=\"*\",IF(AND(OFFSET(INDIRECT(AE23),0,0)>0,NOT(ISNA(OFFSET(INDIRECT(AE23),0,1)))),OFFSET(INDIRECT(AE23),0,1),UnsetMatchCompetitorText),IF(OFFSET(INDIRECT(AE23),2,5)>0,IF(COUNTIF(INDIRECT(AE24),(OFFSET(INDIRECT(AE23),0,5)))>0,OFFSET(INDIRECT(AE23),0,1),IF(COUNTIF(INDIRECT(AE24),(OFFSET(INDIRECT(AE23),1,5)))>0,OFFSET(INDIRECT(AE23),1,1),BlankMatchCompetitorText)),AwaitingMatchCompetitorText))","v":""},null,null,null,null,{"$f":"IF(AK23=NormalWinState,AND(AK22=NormalLoseState,AJ23>AJ22),TRUE)","v":true},null,null,null,null,null,null,null,null,null,null,null,null,null,null,null,null,null,null,null,null,null,null,null,null,null,null,null,null,null,null,null,null,null,null,null,null,null,null,null,null,22,{"$f":"CB22","v":34},{"$f":"CC22+8","v":16},"$P$34",{"$f":"CONCATENATE($B$2)","v":"1"},22,"","09:00:00",0,"","00:00:00","00:00:00","","",0,0,0,"Kristijan HAMZOVSKI",774,0,0,0,false]
[null,null,null,null,null,null,"*",1,"11:11:00","12:43:00",{"$f":"IF(ISBLANK(I24),\"\",IF(ISBLANK(J24),CurrentTime-I24,J24-I24))","v":"01:32:00"},"F",{"$f":"IF(AND(COUNTIF(FinishedMatchStates,L24),NOT(ISNA(VLOOKUP(M22,MatchCompetitorStateCodes,1,FALSE))),NOT(ISNA(VLOOKUP(M23,MatchCompetitorStateCodes,1,FALSE))),COUNTIF(WinStates,M22)+COUNTIF(WinStates,M23)<=1,COUNTIF(LoseStates,M22)+COUNTIF(LoseStates,M23)<=1,IF(M22=NormalWinState,AND(M23=NormalLoseState,L22>L23),TRUE),IF(M23=NormalWinState,AND(M22=NormalLoseState,L23>L22),TRUE),NOT(ISBLANK(L21)),NOT(ISBLANK(I21)),NOT(ISBLANK(I24)),NOT(ISBLANK(J24)),H21>0),1,IF(COUNTIF(FinishedMatchStates,L24)>0,-1,0))","v":1},null,"*",null,null,null,{"$f":"IF(ISBLANK(Q24),\"\",IF(ISBLANK(R24),CurrentTime-Q24,R24-Q24))","v":""},null,{"$f":"IF(AND(COUNTIF(FinishedMatchStates,T24),NOT(ISNA(VLOOKUP(U22,MatchCompetitorStateCodes,1,FALSE))),NOT(ISNA(VLOOKUP(U23,MatchCompetitorStateCodes,1,FALSE))),COUNTIF(WinStates,U22)+COUNTIF(WinStates,U23)<=1,COUNTIF(LoseStates,U22)+COUNTIF(LoseStates,U23)<=1,IF(U22=NormalWinState,AND(U23=NormalLoseState,T22>T23),TRUE),IF(U23=NormalWinState,AND(U22=NormalLoseState,T23>T22),TRUE),NOT(ISBLANK(T21)),NOT(ISBLANK(Q21)),NOT(ISBLANK(Q24)),NOT(ISBLANK(R24)),P21>0),1,IF(COUNTIF(FinishedMatchStates,T24)>0,-1,0))","v":0},null,"*",null,null,null,{"$f":"IF(ISBLANK(Y24),\"\",IF(ISBLANK(Z24),CurrentTime-Y24,Z24-Y24))","v":""},null,{"$f":"IF(AND(COUNTIF(FinishedMatchStates,AB24),NOT(ISNA(VLOOKUP(AC22,MatchCompetitorStateCodes,1,FALSE))),NOT(ISNA(VLOOKUP(AC23,MatchCompetitorStateCodes,1,FALSE))),COUNTIF(WinStates,AC22)+COUNTIF(WinStates,AC23)<=1,COUNTIF(LoseStates,AC22)+COUNTIF(LoseStates,AC23)<=1,IF(AC22=NormalWinState,AND(AC23=NormalLoseState,AB22>AB23),TRUE),IF(AC23=NormalWinState,AND(AC22=NormalLoseState,AB23>AB22),TRUE),NOT(ISBLANK(AB21)),NOT(ISBLANK(Y21)),NOT(ISBLANK(Y24)),NOT(ISBLANK(Z24)),X21>0),1,IF(COUNTIF(FinishedMatchStates,AB24)>0,-1,0))","v":0},null,"*",null,null,null,{"$f":"IF(ISBLANK(AG24),\"\",IF(ISBLANK(AH24),CurrentTime-AG24,AH24-AG24))","v":""},null,{"$f":"IF(AND(COUNTIF(FinishedMatchStates,AJ24),NOT(ISNA(VLOOKUP(AK22,MatchCompetitorStateCodes,1,FALSE))),NOT(ISNA(VLOOKUP(AK23,MatchCompetitorStateCodes,1,FALSE))),COUNTIF(WinStates,AK22)+COUNTIF(WinStates,AK23)<=1,COUNTIF(LoseStates,AK22)+COUNTIF(LoseStates,AK23)<=1,IF(AK22=NormalWinState,AND(AK23=NormalLoseState,AJ22>AJ23),TRUE),IF(AK23=NormalWinState,AND(AK22=NormalLoseState,AJ23>AJ22),TRUE),NOT(ISBLANK(AJ21)),NOT(ISBLANK(AG21)),NOT(ISBLANK(AG24)),NOT(ISBLANK(AH24)),AF21>0),1,IF(COUNTIF(FinishedMatchStates,AJ24)>0,-1,0))","v":0},null,null,null,null,null,null,null,null,null,null,null,null,null,null,null,null,null,null,null,null,null,null,null,null,null,null,null,null,null,null,null,null,null,null,null,null,null,null,null,null,null,23,{"$f":"CB23","v":34},{"$f":"CC23+8","v":24},"$X$34",{"$f":"CONCATENATE($B$2)","v":"1"},23,"2","09:00:00",5,"","09:10:00","10:05:00","00:55:00","Robert REDNAK",178,5,"W","Blaž KOLENC",683,4,"L","F",true]
[null,null,null,null,null,null,null,null,null,null,null,null,null,null,null,null,null,null,null,null,null,null,null,null,null,null,null,null,null,null,null,null,null,null,null,null,null,null,null,null,null,null,null,null,null,null,null,null,null,null,null,null,null,null,null,null,null,null,null,null,null,null,null,null,null,null,null,null,null,null,null,null,null,null,null,null,null,null,24,{"$f":"CB24","v":34},{"$f":"CC24+8","v":32},"$AF$34",{"$f":"CONCATENATE($B$2)","v":"1"},24,"","09:00:00",0,"","00:00:00","00:00:00","","Maks GERČAR",888,0,0,"",0,0,0,0,false]
[null,null,null,null,null,null,{"$f":"G20","v":1},{"$f":"H20+1","v":5},{"$f":"I20","v":1},{"$f":"((H26-1)*$B$3)+I26","v":17},5,1,null,null,{"$f":"G26","v":1},{"$f":"H26","v":5},{"$f":"I26+1","v":2},{"$f":"((P26-1)*$B$3)+Q26","v":18},4,2,null,null,{"$f":"O26","v":1},{"$f":"P26","v":5},{"$f":"Q26+1","v":3},{"$f":"((X26-1)*$B$3)+Y26","v":19},6,7,null,null,{"$f":"W26","v":1},{"$f":"X26","v":5},{"$f":"Y26+1","v":4},{"$f":"((AF26-1)*$B$3)+AG26","v":20},3,8,null,null,null,null,null,null,null,null,null,null,null,null,null,null,null,null,null,null,null,null,null,null,null,null,null,null,null,null,null,null,null,null,null,null,null,null,null,null,null,null,null,null,25,{"$f":"CB22+6","v":40},{"$f":"CC22","v":8},"$H$40","1",25,"","09:00:00",0,"","00:00:00","00:00:00","","",0,0,0,"Levin TKALČIČ",720,0,0,0,false]
[null,null,null,null,null,null,{"$f":"CELL(\"address\",OFFSET($A$5,K26,0))","v":"$A$10"},{"$f":"IF(AND(NOT(ISBLANK(I28)),I28<>UnsetMatchCompetitorText,I28<>AwaitingMatchCompetitorText,NOT(ISBLANK(I29)),I29<>UnsetMatchCompetitorText,I29<>AwaitingMatchCompetitorText),1,IF(AND(I28<>AwaitingMatchCompetitorText,I29<>AwaitingMatchCompetitorText),-1,0))","v":1},"09:00:00",null,null,5,null,null,{"$f":"CELL(\"address\",OFFSET($A$5,S26,0))","v":"$A$9"},{"$f":"IF(AND(NOT(ISBLANK(Q28)),Q28<>UnsetMatchCompetitorText,Q28<>AwaitingMatchCompetitorText,NOT(ISBLANK(Q29)),Q29<>UnsetMatchCompetitorText,Q29<>AwaitingMatchCompetitorText),1,IF(AND(Q28<>AwaitingMatchCompetitorText,Q29<>AwaitingMatchCompetitorText),-1,0))","v":1},"09:00:00",null,null,null,null,null,{"$f":"CELL(\"address\",OFFSET($A$5,AA26,0))","v":"$A$11"},{"$f":"IF(AND(NOT(ISBLANK(Y28)),Y28<>UnsetMatchCompetitorText,Y28<>AwaitingMatchCompetitorText,NOT(ISBLANK(Y29)),Y29<>UnsetMatchCompetitorText,Y29<>AwaitingMatchCompetitorText),1,IF(AND(Y28<>AwaitingMatchCompetitorText,Y29<>AwaitingMatchCompetitorText),-1,0))","v":1},"09:00:00",null,null,null,null,null,{"$f":"CELL(\"address\",OFFSET($A$5,AI26,0))","v":"$A$8"},{"$f":"IF(AND(NOT(ISBLANK(AG28)),AG28<>UnsetMatchCompetitorText,AG28<>AwaitingMatchCompetitorText,NOT(ISBLANK(AG29)),AG29<>UnsetMatchCompetitorText,AG29<>AwaitingMatchCompetitorText),1,IF(AND(AG28<>AwaitingMatchCompetitorText,AG29<>AwaitingMatchCompetitorText),-1,0))","v":1},"09:00:00",null,null,5,null,null,null,null,null,null,null,null,null,null,null,null,null,null,null,null,null,null,null,null,null,null,null,null,null,null,null,null,null,null,null,null,null,null,null,null,null,null,null,null,null,null,26,{"$f":"CB26","v":40},{"$f":"CC26+8","v":16},"$P$40",{"$f":"CONCATENATE($B$2)","v":"1"},26,"","09:00:00",0,"","00:00:00","00:00:00","","",{"$f":"VLOOKUP(CN27,AnnouncementListCompetitors,6,FALSE)","v":0},0,0,"",{"$f":"VLOOKUP(CR27,AnnouncementListCompetitors,6,FALSE)","v":0},0,0,0,false]
[null,null,null,null,null,null,"*",{"$f":"J26","v":17},{"$f":"IF(G28=\"*\",IF(AND(OFFSET(INDIRECT(G27),0,0)>0,NOT(ISNA(OFFSET(INDIRECT(G27),0,1)))),OFFSET(INDIRECT(G27),0,1),UnsetMatchCompetitorText),IF(OFFSET(INDIRECT(G27),2,5)>0,IF(COUNTIF(INDIRECT(G28),(OFFSET(INDIRECT(G27),0,5)))>0,OFFSET(INDIRECT(G27),0,1),IF(COUNTIF(INDIRECT(G28),(OFFSET(INDIRECT(G27),1,5)))>0,OFFSET(INDIRECT(G27),1,1),BlankMatchCompetitorText)),AwaitingMatchCompetitorText))","v":"Kristijan HAMZOVSKI"},null,null,5,"W",{"$f":"IF(M28=NormalWinState,AND(M29=NormalLoseState,L28>L29),TRUE)","v":true},"*",{"$f":"R26","v":18},{"$f":"IF(O28=\"*\",IF(AND(OFFSET(INDIRECT(O27),0,0)>0,NOT(ISNA(OFFSET(INDIRECT(O27),0,1)))),OFFSET(INDIRECT(O27),0,1),UnsetMatchCompetitorText),IF(OFFSET(INDIRECT(O27),2,5)>0,IF(COUNTIF(INDIRECT(O28),(OFFSET(INDIRECT(O27),0,5)))>0,OFFSET(INDIRECT(O27),0,1),IF(COUNTIF(INDIRECT(O28),(OFFSET(INDIRECT(O27),1,5)))>0,OFFSET(INDIRECT(O27),1,1),BlankMatchCompetitorText)),AwaitingMatchCompetitorText))","v":"Blaž KOLENC"},null,null,null,null,{"$f":"IF(U28=NormalWinState,AND(U29=NormalLoseState,T28>T29),TRUE)","v":true},"*",{"$f":"Z26","v":19},{"$f":"IF(W28=\"*\",IF(AND(OFFSET(INDIRECT(W27),0,0)>0,NOT(ISNA(OFFSET(INDIRECT(W27),0,1)))),OFFSET(INDIRECT(W27),0,1),UnsetMatchCompetitorText),IF(OFFSET(INDIRECT(W27),2,5)>0,IF(COUNTIF(INDIRECT(W28),(OFFSET(INDIRECT(W27),0,5)))>0,OFFSET(INDIRECT(W27),0,1),IF(COUNTIF(INDIRECT(W28),(OFFSET(INDIRECT(W27),1,5)))>0,OFFSET(INDIRECT(W27),1,1),BlankMatchCompetitorText)),AwaitingMatchCompetitorText))","v":""},null,null,null,null,{"$f":"IF(AC28=NormalWinState,AND(AC29=NormalLoseState,AB28>AB29),TRUE)","v":true},"*",{"$f":"AH26","v":20},{"$f":"IF(AE28=\"*\",IF(AND(OFFSET(INDIRECT(AE27),0,0)>0,NOT(ISNA(OFFSET(INDIRECT(AE27),0,1)))),OFFSET(INDIRECT(AE27),0,1),UnsetMatchCompetitorText),IF(OFFSET(INDIRECT(AE27),2,5)>0,IF(COUNTIF(INDIRECT(AE28),(OFFSET(INDIRECT(AE27),0,5)))>0,OFFSET(INDIRECT(AE27),0,1),IF(COUNTIF(INDIRECT(AE28),(OFFSET(INDIRECT(AE27),1,5)))>0,OFFSET(INDIRECT(AE27),1,1),BlankMatchCompetitorText)),AwaitingMatchCompetitorText))","v":"Robert REDNAK"},null,null,4,"L",{"$f":"IF(AK28=NormalWinState,AND(AK29=NormalLoseState,AJ28>AJ29),TRUE)","v":true},null,null,null,null,null,null,null,null,null,null,null,null,null,null,null,null,null,null,null,null,null,null,null,null,null,null,null,null,null,null,null,null,null,null,null,null,null,null,null,null,27,{"$f":"CB27","v":40},{"$f":"CC27+8","v":24},"$X$40",{"$f":"CONCATENATE($B$2)","v":"1"},27,"6","09:00:00",5,"","11:49:00","12:38:00","00:49:00","Kristijan HAMZOVSKI",774,5,"W","Robert REDNAK",178,2,"L","F",true]
[null,null,null,null,null,null,{"$f":"CELL(\"address\",OFFSET($A$5,L26,0))","v":"$A$6"},null,{"$f":"IF(G30=\"*\",IF(AND(OFFSET(INDIRECT(G29),0,0)>0,NOT(ISNA(OFFSET(INDIRECT(G29),0,1)))),OFFSET(INDIRECT(G29),0,1),UnsetMatchCompetitorText),IF(OFFSET(INDIRECT(G29),2,5)>0,IF(COUNTIF(INDIRECT(G30),(OFFSET(INDIRECT(G29),0,5)))>0,OFFSET(INDIRECT(G29),0,1),IF(COUNTIF(INDIRECT(G30),(OFFSET(INDIRECT(G29),1,5)))>0,OFFSET(INDIRECT(G29),1,1),BlankMatchCompetitorText)),AwaitingMatchCompetitorText))","v":"Levin TKALČIČ"},null,null,1,"L",{"$f":"IF(M29=NormalWinState,AND(M28=NormalLoseState,L29>L28),TRUE)","v":true},{"$f":"CELL(\"address\",OFFSET($A$5,T26,0))","v":"$A$7"},null,{"$f":"IF(O30=\"*\",IF(AND(OFFSET(INDIRECT(O29),0,0)>0,NOT(ISNA(OFFSET(INDIRECT(O29),0,1)))),OFFSET(INDIRECT(O29),0,1),UnsetMatchCompetitorText),IF(OFFSET(INDIRECT(O29),2,5)>0,IF(COUNTIF(INDIRECT(O30),(OFFSET(INDIRECT(O29),0,5)))>0,OFFSET(INDIRECT(O29),0,1),IF(COUNTIF(INDIRECT(O30),(OFFSET(INDIRECT(O29),1,5)))>0,OFFSET(INDIRECT(O29),1,1),BlankMatchCompetitorText)),AwaitingMatchCompetitorText))","v":""},null,null,null,null,{"$f":"IF(U29=NormalWinState,AND(U28=NormalLoseState,T29>T28),TRUE)","v":true},{"$f":"CELL(\"address\",OFFSET($A$5,AB26,0))","v":"$A$12"},null,{"$f":"IF(W30=\"*\",IF(AND(OFFSET(INDIRECT(W29),0,0)>0,NOT(ISNA(OFFSET(INDIRECT(W29),0,1)))),OFFSET(INDIRECT(W29),0,1),UnsetMatchCompetitorText),IF(OFFSET(INDIRECT(W29),2,5)>0,IF(COUNTIF(INDIRECT(W30),(OFFSET(INDIRECT(W29),0,5)))>0,OFFSET(INDIRECT(W29),0,1),IF(COUNTIF(INDIRECT(W30),(OFFSET(INDIRECT(W29),1,5)))>0,OFFSET(INDIRECT(W29),1,1),BlankMatchCompetitorText)),AwaitingMatchCompetitorText))","v":""},null,null,null,null,{"$f":"IF(AC29=NormalWinState,AND(AC28=NormalLoseState,AB29>AB28),TRUE)","v":true},{"$f":"CELL(\"address\",OFFSET($A$5,AJ26,0))","v":"$A$13"},null,{"$f":"IF(AE30=\"*\",IF(AND(OFFSET(INDIRECT(AE29),0,0)>0,NOT(ISNA(OFFSET(INDIRECT(AE29),0,1)))),OFFSET(INDIRECT(AE29),0,1),UnsetMatchCompetitorText),IF(OFFSET(INDIRECT(AE29),2,5)>0,IF(COUNTIF(INDIRECT(AE30),(OFFSET(INDIRECT(AE29),0,5)))>0,OFFSET(INDIRECT(AE29),0,1),IF(COUNTIF(INDIRECT(AE30),(OFFSET(INDIRECT(AE29),1,5)))>0,OFFSET(INDIRECT(AE29),1,1),BlankMatchCompetitorText)),AwaitingMatchCompetitorText))","v":"Maks GERČAR"},null,null,5,"W",{"$f":"IF(AK29=NormalWinState,AND(AK28=NormalLoseState,AJ29>AJ28),TRUE)","v":true},null,null,null,null,null,null,null,null,null,null,null,null,null,null,null,null,null,null,null,null,null,null,null,null,null,null,null,null,null,null,null,null,null,null,null,null,null,null,null,null,28,{"$f":"CB28","v":40},{"$f":"CC28+8","v":32},"$AF$40",{"$f":"CONCATENATE($B$2)","v":"1"},28,"6","09:00:00",5,"","13:44:00","14:27:00","00:43:00","Blaž KOLENC",683,5,"W","Maks GERČAR",888,2,"L","F",true]
[null,null,null,null,null,null,"*",1,"12:43:00","13:33:00",{"$f":"IF(ISBLANK(I30),\"\",IF(ISBLANK(J30),CurrentTime-I30,J30-I30))","v":"00:50:00"},"F",{"$f":"IF(AND(COUNTIF(FinishedMatchStates,L30),NOT(ISNA(VLOOKUP(M28,MatchCompetitorStateCodes,1,FALSE))),NOT(ISNA(VLOOKUP(M29,MatchCompetitorStateCodes,1,FALSE))),COUNTIF(WinStates,M28)+COUNTIF(WinStates,M29)<=1,COUNTIF(LoseStates,M28)+COUNTIF(LoseStates,M29)<=1,IF(M28=NormalWinState,AND(M29=NormalLoseState,L28>L29),TRUE),IF(M29=NormalWinState,AND(M28=NormalLoseState,L29>L28),TRUE),NOT(ISBLANK(L27)),NOT(ISBLANK(I27)),NOT(ISBLANK(I30)),NOT(ISBLANK(J30)),H27>0),1,IF(COUNTIF(FinishedMatchStates,L30)>0,-1,0))","v":1},null,"*",null,null,null,{"$f":"IF(ISBLANK(Q30),\"\",IF(ISBLANK(R30),CurrentTime-Q30,R30-Q30))","v":""},null,{"$f":"IF(AND(COUNTIF(FinishedMatchStates,T30),NOT(ISNA(VLOOKUP(U28,MatchCompetitorStateCodes,1,FALSE))),NOT(ISNA(VLOOKUP(U29,MatchCompetitorStateCodes,1,FALSE))),COUNTIF(WinStates,U28)+COUNTIF(WinStates,U29)<=1,COUNTIF(LoseStates,U28)+COUNTIF(LoseStates,U29)<=1,IF(U28=NormalWinState,AND(U29=NormalLoseState,T28>T29),TRUE),IF(U29=NormalWinState,AND(U28=NormalLoseState,T29>T28),TRUE),NOT(ISBLANK(T27)),NOT(ISBLANK(Q27)),NOT(ISBLANK(Q30)),NOT(ISBLANK(R30)),P27>0),1,IF(COUNTIF(FinishedMatchStates,T30)>0,-1,0))","v":0},null,"*",null,null,null,{"$f":"IF(ISBLANK(Y30),\"\",IF(ISBLANK(Z30),CurrentTime-Y30,Z30-Y30))","v":""},null,{"$f":"IF(AND(COUNTIF(FinishedMatchStates,AB30),NOT(ISNA(VLOOKUP(AC28,MatchCompetitorStateCodes,1,FALSE))),NOT(ISNA(VLOOKUP(AC29,MatchCompetitorStateCodes,1,FALSE))),COUNTIF(WinStates,AC28)+COUNTIF(WinStates,AC29)<=1,COUNTIF(LoseStates,AC28)+COUNTIF(LoseStates,AC29)<=1,IF(AC28=NormalWinState,AND(AC29=NormalLoseState,AB28>AB29),TRUE),IF(AC29=NormalWinState,AND(AC28=NormalLoseState,AB29>AB28),TRUE),NOT(ISBLANK(AB27)),NOT(ISBLANK(Y27)),NOT(ISBLANK(Y30)),NOT(ISBLANK(Z30)),X27>0),1,IF(COUNTIF(FinishedMatchStates,AB30)>0,-1,0))","v":0},null,"*",6,"12:39:00","13:43:00",{"$f":"IF(ISBLANK(AG30),\"\",IF(ISBLANK(AH30),CurrentTime-AG30,AH30-AG30))","v":"01:04:00"},"F",{"$f":"IF(AND(COUNTIF(FinishedMatchStates,AJ30),NOT(ISNA(VLOOKUP(AK28,MatchCompetitorStateCodes,1,FALSE))),NOT(ISNA(VLOOKUP(AK29,MatchCompetitorStateCodes,1,FALSE))),COUNTIF(WinStates,AK28)+COUNTIF(WinStates,AK29)<=1,COUNTIF(LoseStates,AK28)+COUNTIF(LoseStates,AK29)<=1,IF(AK28=NormalWinState,AND(AK29=NormalLoseState,AJ28>AJ29),TRUE),IF(AK29=NormalWinState,AND(AK28=NormalLoseState,AJ29>AJ28),TRUE),NOT(ISBLANK(AJ27)),NOT(ISBLANK(AG27)),NOT(ISBLANK(AG30)),NOT(ISBLANK(AH30)),AF27>0),1,IF(COUNTIF(FinishedMatchStates,AJ30)>0,-1,0))","v":1}]
[]
[null,null,null,null,null,null,{"$f":"G26","v":1},{"$f":"H26+1","v":6},{"$f":"I26","v":1},{"$f":"((H32-1)*$B$3)+I32","v":21},1,6,null,null,{"$f":"G32","v":1},{"$f":"H32","v":6},{"$f":"I32+1","v":2},{"$f":"((P32-1)*$B$3)+Q32","v":22},2,5,null,null,{"$f":"O32","v":1},{"$f":"P32","v":6},{"$f":"Q32+1","v":3},{"$f":"((X32-1)*$B$3)+Y32","v":23},3,4,null,null,{"$f":"W32","v":1},{"$f":"X32","v":6},{"$f":"Y32+1","v":4},{"$f":"((AF32-1)*$B$3)+AG32","v":24},8,7]
[null,null,null,null,null,null,{"$f":"CELL(\"address\",OFFSET($A$5,K32,0))","v":"$A$6"},{"$f":"IF(AND(NOT(ISBLANK(I34)),I34<>UnsetMatchCompetitorText,I34<>AwaitingMatchCompetitorText,NOT(ISBLANK(I35)),I35<>UnsetMatchCompetitorText,I35<>AwaitingMatchCompetitorText),1,IF(AND(I34<>AwaitingMatchCompetitorText,I35<>AwaitingMatchCompetitorText),-1,0))","v":1},"09:00:00",null,null,null,null,null,{"$f":"CELL(\"address\",OFFSET($A$5,S32,0))","v":"$A$7"},{"$f":"IF(AND(NOT(ISBLANK(Q34)),Q34<>UnsetMatchCompetitorText,Q34<>AwaitingMatchCompetitorText,NOT(ISBLANK(Q35)),Q35<>UnsetMatchCompetitorText,Q35<>AwaitingMatchCompetitorText),1,IF(AND(Q34<>AwaitingMatchCompetitorText,Q35<>AwaitingMatchCompetitorText),-1,0))","v":1},"09:00:00",null,null,null,null,null,{"$f":"CELL(\"address\",OFFSET($A$5,AA32,0))","v":"$A$8"},{"$f":"IF(AND(NOT(ISBLANK(Y34)),Y34<>UnsetMatchCompetitorText,Y34<>AwaitingMatchCompetitorText,NOT(ISBLANK(Y35)),Y35<>UnsetMatchCompetitorText,Y35<>AwaitingMatchCompetitorText),1,IF(AND(Y34<>AwaitingMatchCompetitorText,Y35<>AwaitingMatchCompetitorText),-1,0))","v":1},"09:00:00",null,null,5,null,null,{"$f":"CELL(\"address\",OFFSET($A$5,AI32,0))","v":"$A$13"},{"$f":"IF(AND(NOT(ISBLANK(AG34)),AG34<>UnsetMatchCompetitorText,AG34<>AwaitingMatchCompetitorText,NOT(ISBLANK(AG35)),AG35<>UnsetMatchCompetitorText,AG35<>AwaitingMatchCompetitorText),1,IF(AND(AG34<>AwaitingMatchCompetitorText,AG35<>AwaitingMatchCompetitorText),-1,0))","v":1},"09:00:00"]
[null,null,null,null,null,null,"*",{"$f":"J32","v":21},{"$f":"IF(G34=\"*\",IF(AND(OFFSET(INDIRECT(G33),0,0)>0,NOT(ISNA(OFFSET(INDIRECT(G33),0,1)))),OFFSET(INDIRECT(G33),0,1),UnsetMatchCompetitorText),IF(OFFSET(INDIRECT(G33),2,5)>0,IF(COUNTIF(INDIRECT(G34),(OFFSET(INDIRECT(G33),0,5)))>0,OFFSET(INDIRECT(G33),0,1),IF(COUNTIF(INDIRECT(G34),(OFFSET(INDIRECT(G33),1,5)))>0,OFFSET(INDIRECT(G33),1,1),BlankMatchCompetitorText)),AwaitingMatchCompetitorText))","v":"Levin TKALČIČ"},null,null,null,null,{"$f":"IF(M34=NormalWinState,AND(M35=NormalLoseState,L34>L35),TRUE)","v":true},"*",{"$f":"R32","v":22},{"$f":"IF(O34=\"*\",IF(AND(OFFSET(INDIRECT(O33),0,0)>0,NOT(ISNA(OFFSET(INDIRECT(O33),0,1)))),OFFSET(INDIRECT(O33),0,1),UnsetMatchCompetitorText),IF(OFFSET(INDIRECT(O33),2,5)>0,IF(COUNTIF(INDIRECT(O34),(OFFSET(INDIRECT(O33),0,5)))>0,OFFSET(INDIRECT(O33),0,1),IF(COUNTIF(INDIRECT(O34),(OFFSET(INDIRECT(O33),1,5)))>0,OFFSET(INDIRECT(O33),1,1),BlankMatchCompetitorText)),AwaitingMatchCompetitorText))","v":""},null,null,null,null,{"$f":"IF(U34=NormalWinState,AND(U35=NormalLoseState,T34>T35),TRUE)","v":true},"*",{"$f":"Z32","v":23},{"$f":"IF(W34=\"*\",IF(AND(OFFSET(INDIRECT(W33),0,0)>0,NOT(ISNA(OFFSET(INDIRECT(W33),0,1)))),OFFSET(INDIRECT(W33),0,1),UnsetMatchCompetitorText),IF(OFFSET(INDIRECT(W33),2,5)>0,IF(COUNTIF(INDIRECT(W34),(OFFSET(INDIRECT(W33),0,5)))>0,OFFSET(INDIRECT(W33),0,1),IF(COUNTIF(INDIRECT(W34),(OFFSET(INDIRECT(W33),1,5)))>0,OFFSET(INDIRECT(W33),1,1),BlankMatchCompetitorText)),AwaitingMatchCompetitorText))","v":"Robert REDNAK"},null,null,5,"W",{"$f":"IF(AC34=NormalWinState,AND(AC35=NormalLoseState,AB34>AB35),TRUE)","v":true},"*",{"$f":"AH32","v":24},{"$f":"IF(AE34=\"*\",IF(AND(OFFSET(INDIRECT(AE33),0,0)>0,NOT(ISNA(OFFSET(INDIRECT(AE33),0,1)))),OFFSET(INDIRECT(AE33),0,1),UnsetMatchCompetitorText),IF(OFFSET(INDIRECT(AE33),2,5)>0,IF(COUNTIF(INDIRECT(AE34),(OFFSET(INDIRECT(AE33),0,5)))>0,OFFSET(INDIRECT(AE33),0,1),IF(COUNTIF(INDIRECT(AE34),(OFFSET(INDIRECT(AE33),1,5)))>0,OFFSET(INDIRECT(AE33),1,1),BlankMatchCompetitorText)),AwaitingMatchCompetitorText))","v":"Maks GERČAR"},null,null,null,null,{"$f":"IF(AK34=NormalWinState,AND(AK35=NormalLoseState,AJ34>AJ35),TRUE)","v":true}]
[null,null,null,null,null,null,{"$f":"CELL(\"address\",OFFSET($A$5,L32,0))","v":"$A$11"},null,{"$f":"IF(G36=\"*\",IF(AND(OFFSET(INDIRECT(G35),0,0)>0,NOT(ISNA(OFFSET(INDIRECT(G35),0,1)))),OFFSET(INDIRECT(G35),0,1),UnsetMatchCompetitorText),IF(OFFSET(INDIRECT(G35),2,5)>0,IF(COUNTIF(INDIRECT(G36),(OFFSET(INDIRECT(G35),0,5)))>0,OFFSET(INDIRECT(G35),0,1),IF(COUNTIF(INDIRECT(G36),(OFFSET(INDIRECT(G35),1,5)))>0,OFFSET(INDIRECT(G35),1,1),BlankMatchCompetitorText)),AwaitingMatchCompetitorText))","v":""},null,null,null,null,{"$f":"IF(M35=NormalWinState,AND(M34=NormalLoseState,L35>L34),TRUE)","v":true},{"$f":"CELL(\"address\",OFFSET($A$5,T32,0))","v":"$A$10"},null,{"$f":"IF(O36=\"*\",IF(AND(OFFSET(INDIRECT(O35),0,0)>0,NOT(ISNA(OFFSET(INDIRECT(O35),0,1)))),OFFSET(INDIRECT(O35),0,1),UnsetMatchCompetitorText),IF(OFFSET(INDIRECT(O35),2,5)>0,IF(COUNTIF(INDIRECT(O36),(OFFSET(INDIRECT(O35),0,5)))>0,OFFSET(INDIRECT(O35),0,1),IF(COUNTIF(INDIRECT(O36),(OFFSET(INDIRECT(O35),1,5)))>0,OFFSET(INDIRECT(O35),1,1),BlankMatchCompetitorText)),AwaitingMatchCompetitorText))","v":"Kristijan HAMZOVSKI"},null,null,null,null,{"$f":"IF(U35=NormalWinState,AND(U34=NormalLoseState,T35>T34),TRUE)","v":true},{"$f":"CELL(\"address\",OFFSET($A$5,AB32,0))","v":"$A$9"},null,{"$f":"IF(W36=\"*\",IF(AND(OFFSET(INDIRECT(W35),0,0)>0,NOT(ISNA(OFFSET(INDIRECT(W35),0,1)))),OFFSET(INDIRECT(W35),0,1),UnsetMatchCompetitorText),IF(OFFSET(INDIRECT(W35),2,5)>0,IF(COUNTIF(INDIRECT(W36),(OFFSET(INDIRECT(W35),0,5)))>0,OFFSET(INDIRECT(W35),0,1),IF(COUNTIF(INDIRECT(W36),(OFFSET(INDIRECT(W35),1,5)))>0,OFFSET(INDIRECT(W35),1,1),BlankMatchCompetitorText)),AwaitingMatchCompetitorText))","v":"Blaž KOLENC"},null,null,4,"L",{"$f":"IF(AC35=NormalWinState,AND(AC34=NormalLoseState,AB35>AB34),TRUE)","v":true},{"$f":"CELL(\"address\",OFFSET($A$5,AJ32,0))","v":"$A$12"},null,{"$f":"IF(AE36=\"*\",IF(AND(OFFSET(INDIRECT(AE35),0,0)>0,NOT(ISNA(OFFSET(INDIRECT(AE35),0,1)))),OFFSET(INDIRECT(AE35),0,1),UnsetMatchCompetitorText),IF(OFFSET(INDIRECT(AE35),2,5)>0,IF(COUNTIF(INDIRECT(AE36),(OFFSET(INDIRECT(AE35),0,5)))>0,OFFSET(INDIRECT(AE35),0,1),IF(COUNTIF(INDIRECT(AE36),(OFFSET(INDIRECT(AE35),1,5)))>0,OFFSET(INDIRECT(AE35),1,1),BlankMatchCompetitorText)),AwaitingMatchCompetitorText))","v":""},null,null,null,null,{"$f":"IF(AK35=NormalWinState,AND(AK34=NormalLoseState,AJ35>AJ34),TRUE)","v":true}]
[null,null,null,null,null,null,"*",null,null,null,{"$f":"IF(ISBLANK(I36),\"\",IF(ISBLANK(J36),CurrentTime-I36,J36-I36))","v":""},null,{"$f":"IF(AND(COUNTIF(FinishedMatchStates,L36),NOT(ISNA(VLOOKUP(M34,MatchCompetitorStateCodes,1,FALSE))),NOT(ISNA(VLOOKUP(M35,MatchCompetitorStateCodes,1,FALSE))),COUNTIF(WinStates,M34)+COUNTIF(WinStates,M35)<=1,COUNTIF(LoseStates,M34)+COUNTIF(LoseStates,M35)<=1,IF(M34=NormalWinState,AND(M35=NormalLoseState,L34>L35),TRUE),IF(M35=NormalWinState,AND(M34=NormalLoseState,L35>L34),TRUE),NOT(ISBLANK(L33)),NOT(ISBLANK(I33)),NOT(ISBLANK(I36)),NOT(ISBLANK(J36)),H33>0),1,IF(COUNTIF(FinishedMatchStates,L36)>0,-1,0))","v":0},null,"*",null,null,null,{"$f":"IF(ISBLANK(Q36),\"\",IF(ISBLANK(R36),CurrentTime-Q36,R36-Q36))","v":""},null,{"$f":"IF(AND(COUNTIF(FinishedMatchStates,T36),NOT(ISNA(VLOOKUP(U34,MatchCompetitorStateCodes,1,FALSE))),NOT(ISNA(VLOOKUP(U35,MatchCompetitorStateCodes,1,FALSE))),COUNTIF(WinStates,U34)+COUNTIF(WinStates,U35)<=1,COUNTIF(LoseStates,U34)+COUNTIF(LoseStates,U35)<=1,IF(U34=NormalWinState,AND(U35=NormalLoseState,T34>T35),TRUE),IF(U35=NormalWinState,AND(U34=NormalLoseState,T35>T34),TRUE),NOT(ISBLANK(T33)),NOT(ISBLANK(Q33)),NOT(ISBLANK(Q36)),NOT(ISBLANK(R36)),P33>0),1,IF(COUNTIF(FinishedMatchStates,T36)>0,-1,0))","v":0},null,"*",2,"09:10:00","10:05:00",{"$f":"IF(ISBLANK(Y36),\"\",IF(ISBLANK(Z36),CurrentTime-Y36,Z36-Y36))","v":"00:55:00"},"F",{"$f":"IF(AND(COUNTIF(FinishedMatchStates,AB36),NOT(ISNA(VLOOKUP(AC34,MatchCompetitorStateCodes,1,FALSE))),NOT(ISNA(VLOOKUP(AC35,MatchCompetitorStateCodes,1,FALSE))),COUNTIF(WinStates,AC34)+COUNTIF(WinStates,AC35)<=1,COUNTIF(LoseStates,AC34)+COUNTIF(LoseStates,AC35)<=1,IF(AC34=NormalWinState,AND(AC35=NormalLoseState,AB34>AB35),TRUE),IF(AC35=NormalWinState,AND(AC34=NormalLoseState,AB35>AB34),TRUE),NOT(ISBLANK(AB33)),NOT(ISBLANK(Y33)),NOT(ISBLANK(Y36)),NOT(ISBLANK(Z36)),X33>0),1,IF(COUNTIF(FinishedMatchStates,AB36)>0,-1,0))","v":1},null,"*",null,null,null,{"$f":"IF(ISBLANK(AG36),\"\",IF(ISBLANK(AH36),CurrentTime-AG36,AH36-AG36))","v":""},null,{"$f":"IF(AND(COUNTIF(FinishedMatchStates,AJ36),NOT(ISNA(VLOOKUP(AK34,MatchCompetitorStateCodes,1,FALSE))),NOT(ISNA(VLOOKUP(AK35,MatchCompetitorStateCodes,1,FALSE))),COUNTIF(WinStates,AK34)+COUNTIF(WinStates,AK35)<=1,COUNTIF(LoseStates,AK34)+COUNTIF(LoseStates,AK35)<=1,IF(AK34=NormalWinState,AND(AK35=NormalLoseState,AJ34>AJ35),TRUE),IF(AK35=NormalWinState,AND(AK34=NormalLoseState,AJ35>AJ34),TRUE),NOT(ISBLANK(AJ33)),NOT(ISBLANK(AG33)),NOT(ISBLANK(AG36)),NOT(ISBLANK(AH36)),AF33>0),1,IF(COUNTIF(FinishedMatchStates,AJ36)>0,-1,0))","v":0}]
[]
[null,null,null,null,null,null,{"$f":"G32","v":1},{"$f":"H32+1","v":7},{"$f":"I32","v":1},{"$f":"((H38-1)*$B$3)+I38","v":25},7,1,null,null,{"$f":"G38","v":1},{"$f":"H38","v":7},{"$f":"I38+1","v":2},{"$f":"((P38-1)*$B$3)+Q38","v":26},6,2,null,null,{"$f":"O38","v":1},{"$f":"P38","v":7},{"$f":"Q38+1","v":3},{"$f":"((X38-1)*$B$3)+Y38","v":27},5,3,null,null,{"$f":"W38","v":1},{"$f":"X38","v":7},{"$f":"Y38+1","v":4},{"$f":"((AF38-1)*$B$3)+AG38","v":28},4,8]
[null,null,null,null,null,null,{"$f":"CELL(\"address\",OFFSET($A$5,K38,0))","v":"$A$12"},{"$f":"IF(AND(NOT(ISBLANK(I40)),I40<>UnsetMatchCompetitorText,I40<>AwaitingMatchCompetitorText,NOT(ISBLANK(I41)),I41<>UnsetMatchCompetitorText,I41<>AwaitingMatchCompetitorText),1,IF(AND(I40<>AwaitingMatchCompetitorText,I41<>AwaitingMatchCompetitorText),-1,0))","v":1},"09:00:00",null,null,null,null,null,{"$f":"CELL(\"address\",OFFSET($A$5,S38,0))","v":"$A$11"},{"$f":"IF(AND(NOT(ISBLANK(Q40)),Q40<>UnsetMatchCompetitorText,Q40<>AwaitingMatchCompetitorText,NOT(ISBLANK(Q41)),Q41<>UnsetMatchCompetitorText,Q41<>AwaitingMatchCompetitorText),1,IF(AND(Q40<>AwaitingMatchCompetitorText,Q41<>AwaitingMatchCompetitorText),-1,0))","v":1},"09:00:00",null,null,null,null,null,{"$f":"CELL(\"address\",OFFSET($A$5,AA38,0))","v":"$A$10"},{"$f":"IF(AND(NOT(ISBLANK(Y40)),Y40<>UnsetMatchCompetitorText,Y40<>AwaitingMatchCompetitorText,NOT(ISBLANK(Y41)),Y41<>UnsetMatchCompetitorText,Y41<>AwaitingMatchCompetitorText),1,IF(AND(Y40<>AwaitingMatchCompetitorText,Y41<>AwaitingMatchCompetitorText),-1,0))","v":1},"09:00:00",null,null,5,null,null,{"$f":"CELL(\"address\",OFFSET($A$5,AI38,0))","v":"$A$9"},{"$f":"IF(AND(NOT(ISBLANK(AG40)),AG40<>UnsetMatchCompetitorText,AG40<>AwaitingMatchCompetitorText,NOT(ISBLANK(AG41)),AG41<>UnsetMatchCompetitorText,AG41<>AwaitingMatchCompetitorText),1,IF(AND(AG40<>AwaitingMatchCompetitorText,AG41<>AwaitingMatchCompetitorText),-1,0))","v":1},"09:00:00",null,null,5]
[null,null,null,null,null,null,"*",{"$f":"J38","v":25},{"$f":"IF(G40=\"*\",IF(AND(OFFSET(INDIRECT(G39),0,0)>0,NOT(ISNA(OFFSET(INDIRECT(G39),0,1)))),OFFSET(INDIRECT(G39),0,1),UnsetMatchCompetitorText),IF(OFFSET(INDIRECT(G39),2,5)>0,IF(COUNTIF(INDIRECT(G40),(OFFSET(INDIRECT(G39),0,5)))>0,OFFSET(INDIRECT(G39),0,1),IF(COUNTIF(INDIRECT(G40),(OFFSET(INDIRECT(G39),1,5)))>0,OFFSET(INDIRECT(G39),1,1),BlankMatchCompetitorText)),AwaitingMatchCompetitorText))","v":""},null,null,null,null,{"$f":"IF(M40=NormalWinState,AND(M41=NormalLoseState,L40>L41),TRUE)","v":true},"*",{"$f":"R38","v":26},{"$f":"IF(O40=\"*\",IF(AND(OFFSET(INDIRECT(O39),0,0)>0,NOT(ISNA(OFFSET(INDIRECT(O39),0,1)))),OFFSET(INDIRECT(O39),0,1),UnsetMatchCompetitorText),IF(OFFSET(INDIRECT(O39),2,5)>0,IF(COUNTIF(INDIRECT(O40),(OFFSET(INDIRECT(O39),0,5)))>0,OFFSET(INDIRECT(O39),0,1),IF(COUNTIF(INDIRECT(O40),(OFFSET(INDIRECT(O39),1,5)))>0,OFFSET(INDIRECT(O39),1,1),BlankMatchCompetitorText)),AwaitingMatchCompetitorText))","v":""},null,null,null,null,{"$f":"IF(U40=NormalWinState,AND(U41=NormalLoseState,T40>T41),TRUE)","v":true},"*",{"$f":"Z38","v":27},{"$f":"IF(W40=\"*\",IF(AND(OFFSET(INDIRECT(W39),0,0)>0,NOT(ISNA(OFFSET(INDIRECT(W39),0,1)))),OFFSET(INDIRECT(W39),0,1),UnsetMatchCompetitorText),IF(OFFSET(INDIRECT(W39),2,5)>0,IF(COUNTIF(INDIRECT(W40),(OFFSET(INDIRECT(W39),0,5)))>0,OFFSET(INDIRECT(W39),0,1),IF(COUNTIF(INDIRECT(W40),(OFFSET(INDIRECT(W39),1,5)))>0,OFFSET(INDIRECT(W39),1,1),BlankMatchCompetitorText)),AwaitingMatchCompetitorText))","v":"Kristijan HAMZOVSKI"},null,null,5,"W",{"$f":"IF(AC40=NormalWinState,AND(AC41=NormalLoseState,AB40>AB41),TRUE)","v":true},"*",{"$f":"AH38","v":28},{"$f":"IF(AE40=\"*\",IF(AND(OFFSET(INDIRECT(AE39),0,0)>0,NOT(ISNA(OFFSET(INDIRECT(AE39),0,1)))),OFFSET(INDIRECT(AE39),0,1),UnsetMatchCompetitorText),IF(OFFSET(INDIRECT(AE39),2,5)>0,IF(COUNTIF(INDIRECT(AE40),(OFFSET(INDIRECT(AE39),0,5)))>0,OFFSET(INDIRECT(AE39),0,1),IF(COUNTIF(INDIRECT(AE40),(OFFSET(INDIRECT(AE39),1,5)))>0,OFFSET(INDIRECT(AE39),1,1),BlankMatchCompetitorText)),AwaitingMatchCompetitorText))","v":"Blaž KOLENC"},null,null,5,"W",{"$f":"IF(AK40=NormalWinState,AND(AK41=NormalLoseState,AJ40>AJ41),TRUE)","v":true}]
[null,null,null,null,null,null,{"$f":"CELL(\"address\",OFFSET($A$5,L38,0))","v":"$A$6"},null,{"$f":"IF(G42=\"*\",IF(AND(OFFSET(INDIRECT(G41),0,0)>0,NOT(ISNA(OFFSET(INDIRECT(G41),0,1)))),OFFSET(INDIRECT(G41),0,1),UnsetMatchCompetitorText),IF(OFFSET(INDIRECT(G41),2,5)>0,IF(COUNTIF(INDIRECT(G42),(OFFSET(INDIRECT(G41),0,5)))>0,OFFSET(INDIRECT(G41),0,1),IF(COUNTIF(INDIRECT(G42),(OFFSET(INDIRECT(G41),1,5)))>0,OFFSET(INDIRECT(G41),1,1),BlankMatchCompetitorText)),AwaitingMatchCompetitorText))","v":"Levin TKALČIČ"},null,null,null,null,{"$f":"IF(M41=NormalWinState,AND(M40=NormalLoseState,L41>L40),TRUE)","v":true},{"$f":"CELL(\"address\",OFFSET($A$5,T38,0))","v":"$A$7"},null,{"$f":"IF(O42=\"*\",IF(AND(OFFSET(INDIRECT(O41),0,0)>0,NOT(ISNA(OFFSET(INDIRECT(O41),0,1)))),OFFSET(INDIRECT(O41),0,1),UnsetMatchCompetitorText),IF(OFFSET(INDIRECT(O41),2,5)>0,IF(COUNTIF(INDIRECT(O42),(OFFSET(INDIRECT(O41),0,5)))>0,OFFSET(INDIRECT(O41),0,1),IF(COUNTIF(INDIRECT(O42),(OFFSET(INDIRECT(O41),1,5)))>0,OFFSET(INDIRECT(O41),1,1),BlankMatchCompetitorText)),AwaitingMatchCompetitorText))","v":""},null,null,null,null,{"$f":"IF(U41=NormalWinState,AND(U40=NormalLoseState,T41>T40),TRUE)","v":true},{"$f":"CELL(\"address\",OFFSET($A$5,AB38,0))","v":"$A$8"},null,{"$f":"IF(W42=\"*\",IF(AND(OFFSET(INDIRECT(W41),0,0)>0,NOT(ISNA(OFFSET(INDIRECT(W41),0,1)))),OFFSET(INDIRECT(W41),0,1),UnsetMatchCompetitorText),IF(OFFSET(INDIRECT(W41),2,5)>0,IF(COUNTIF(INDIRECT(W42),(OFFSET(INDIRECT(W41),0,5)))>0,OFFSET(INDIRECT(W41),0,1),IF(COUNTIF(INDIRECT(W42),(OFFSET(INDIRECT(W41),1,5)))>0,OFFSET(INDIRECT(W41),1,1),BlankMatchCompetitorText)),AwaitingMatchCompetitorText))","v":"Robert REDNAK"},null,null,2,"L",{"$f":"IF(AC41=NormalWinState,AND(AC40=NormalLoseState,AB41>AB40),TRUE)","v":true},{"$f":"CELL(\"address\",OFFSET($A$5,AJ38,0))","v":"$A$13"},null,{"$f":"IF(AE42=\"*\",IF(AND(OFFSET(INDIRECT(AE41),0,0)>0,NOT(ISNA(OFFSET(INDIRECT(AE41),0,1)))),OFFSET(INDIRECT(AE41),0,1),UnsetMatchCompetitorText),IF(OFFSET(INDIRECT(AE41),2,5)>0,IF(COUNTIF(INDIRECT(AE42),(OFFSET(INDIRECT(AE41),0,5)))>0,OFFSET(INDIRECT(AE41),0,1),IF(COUNTIF(INDIRECT(AE42),(OFFSET(INDIRECT(AE41),1,5)))>0,OFFSET(INDIRECT(AE41),1,1),BlankMatchCompetitorText)),AwaitingMatchCompetitorText))","v":"Maks GERČAR"},null,null,2,"L",{"$f":"IF(AK41=NormalWinState,AND(AK40=NormalLoseState,AJ41>AJ40),TRUE)","v":true}]
[null,null,null,null,null,null,"*",null,null,null,{"$f":"IF(ISBLANK(I42),\"\",IF(ISBLANK(J42),CurrentTime-I42,J42-I42))","v":""},null,{"$f":"IF(AND(COUNTIF(FinishedMatchStates,L42),NOT(ISNA(VLOOKUP(M40,MatchCompetitorStateCodes,1,FALSE))),NOT(ISNA(VLOOKUP(M41,MatchCompetitorStateCodes,1,FALSE))),COUNTIF(WinStates,M40)+COUNTIF(WinStates,M41)<=1,COUNTIF(LoseStates,M40)+COUNTIF(LoseStates,M41)<=1,IF(M40=NormalWinState,AND(M41=NormalLoseState,L40>L41),TRUE),IF(M41=NormalWinState,AND(M40=NormalLoseState,L41>L40),TRUE),NOT(ISBLANK(L39)),NOT(ISBLANK(I39)),NOT(ISBLANK(I42)),NOT(ISBLANK(J42)),H39>0),1,IF(COUNTIF(FinishedMatchStates,L42)>0,-1,0))","v":0},null,"*",null,null,null,{"$f":"IF(ISBLANK(Q42),\"\",IF(ISBLANK(R42),CurrentTime-Q42,R42-Q42))","v":""},null,{"$f":"IF(AND(COUNTIF(FinishedMatchStates,T42),NOT(ISNA(VLOOKUP(U40,MatchCompetitorStateCodes,1,FALSE))),NOT(ISNA(VLOOKUP(U41,MatchCompetitorStateCodes,1,FALSE))),COUNTIF(WinStates,U40)+COUNTIF(WinStates,U41)<=1,COUNTIF(LoseStates,U40)+COUNTIF(LoseStates,U41)<=1,IF(U40=NormalWinState,AND(U41=NormalLoseState,T40>T41),TRUE),IF(U41=NormalWinState,AND(U40=NormalLoseState,T41>T40),TRUE),NOT(ISBLANK(T39)),NOT(ISBLANK(Q39)),NOT(ISBLANK(Q42)),NOT(ISBLANK(R42)),P39>0),1,IF(COUNTIF(FinishedMatchStates,T42)>0,-1,0))","v":0},null,"*",6,"11:49:00","12:38:00",{"$f":"IF(ISBLANK(Y42),\"\",IF(ISBLANK(Z42),CurrentTime-Y42,Z42-Y42))","v":"00:49:00"},"F",{"$f":"IF(AND(COUNTIF(FinishedMatchStates,AB42),NOT(ISNA(VLOOKUP(AC40,MatchCompetitorStateCodes,1,FALSE))),NOT(ISNA(VLOOKUP(AC41,MatchCompetitorStateCodes,1,FALSE))),COUNTIF(WinStates,AC40)+COUNTIF(WinStates,AC41)<=1,COUNTIF(LoseStates,AC40)+COUNTIF(LoseStates,AC41)<=1,IF(AC40=NormalWinState,AND(AC41=NormalLoseState,AB40>AB41),TRUE),IF(AC41=NormalWinState,AND(AC40=NormalLoseState,AB41>AB40),TRUE),NOT(ISBLANK(AB39)),NOT(ISBLANK(Y39)),NOT(ISBLANK(Y42)),NOT(ISBLANK(Z42)),X39>0),1,IF(COUNTIF(FinishedMatchStates,AB42)>0,-1,0))","v":1},null,"*",6,"13:44:00","14:27:00",{"$f":"IF(ISBLANK(AG42),\"\",IF(ISBLANK(AH42),CurrentTime-AG42,AH42-AG42))","v":"00:43:00"},"F",{"$f":"IF(AND(COUNTIF(FinishedMatchStates,AJ42),NOT(ISNA(VLOOKUP(AK40,MatchCompetitorStateCodes,1,FALSE))),NOT(ISNA(VLOOKUP(AK41,MatchCompetitorStateCodes,1,FALSE))),COUNTIF(WinStates,AK40)+COUNTIF(WinStates,AK41)<=1,COUNTIF(LoseStates,AK40)+COUNTIF(LoseStates,AK41)<=1,IF(AK40=NormalWinState,AND(AK41=NormalLoseState,AJ40>AJ41),TRUE),IF(AK41=NormalWinState,AND(AK40=NormalLoseState,AJ41>AJ40),TRUE),NOT(ISBLANK(AJ39)),NOT(ISBLANK(AG39)),NOT(ISBLANK(AG42)),NOT(ISBLANK(AH42)),AF39>0),1,IF(COUNTIF(FinishedMatchStates,AJ42)>0,-1,0))","v":1}]

{"sheet":"Skupina 2","index":4,"n_rows":42,"n_cols":101,"rows_kept":42,"cut":false,"hidden":false,"merged":[[0,0,0,4],[2,9,2,10],[2,17,2,18],[2,25,2,26],[2,33,2,34],[3,7,4,7],[3,8,3,10],[3,15,4,15],[3,16,3,18],[3,23,4,23],[5,53,6,53],[7,53,8,53],[8,9,8,10],[8,17,8,18],[8,25,8,26],[8,33,8,34],[3,24,3,26],[3,31,4,31],[3,32,3,34],[3,53,4,53],[4,8,4,10],[4,16,4,18],[4,24,4,26],[4,32,4,34],[15,7,16,7],[15,8,15,10],[15,15,16,15],[15,16,15,18],[15,23,16,23],[15,24,15,26],[9,31,10,31],[9,32,9,34],[9,53,10,53],[10,8,10,10],[10,16,10,18],[10,24,10,26],[10,32,10,34],[9,7,10,7],[9,8,9,10],[9,15,10,15],[9,16,9,18],[9,23,10,23],[9,24,9,26],[15,31,16,31],[15,32,15,34],[16,8,16,10],[16,16,16,18],[16,24,16,26],[16,32,16,34],[14,9,14,10],[14,17,14,18],[14,25,14,26],[14,33,14,34],[20,9,20,10],[20,17,20,18],[20,25,20,26],[20,33,20,34],[21,7,22,7],[21,8,21,10],[21,15,22,15],[21,16,21,18],[21,23,22,23],[21,24,21,26],[27,7,28,7],[27,8,27,10],[27,15,28,15],[27,16,27,18],[27,23,28,23],[27,24,27,26],[21,31,22,31],[21,32,21,34],[22,8,22,10],[22,16,22,18],[22,24,22,26],[22,32,22,34],[27,31,28,31],[27,32,27,34],[28,8,28,10],[28,16,28,18],[28,24,28,26],[28,32,28,34],[26,9,26,10],[26,17,26,18],[26,25,26,26],[26,33,26,34],[32,9,32,10],[32,17,32,18],[32,25,32,26],[32,33,32,34],[33,7,34,7],[33,8,33,10],[33,15,34,15],[33,16,33,18],[33,23,34,23],[33,24,33,26],[39,7,40,7],[39,8,39,10],[39,15,40,15],[39,16,39,18],[39,23,40,23],[39,24,39,26],[33,31,34,31],[33,32,33,34],[34,8,34,10],[34,16,34,18],[34,24,34,26],[34,32,34,34],[39,31,40,31],[39,32,39,34],[40,8,40,10],[40,16,40,18],[40,24,40,26],[40,32,40,34],[38,9,38,10],[38,17,38,18],[38,25,38,26],[38,33,38,34]]}
["Nastavitve",null,null,null,null,null,"Group","Round","Order","Match","P1","P2",null,null,null,null,null,null,null,null,null,null,null,null,null,null,null,null,null,null,null,null,null,null,null,null,null,null,null,null,null,null,null,null,null,null,null,null,null,null,null,null,null,null,null,null,null,null,null,null,null,null,null,null,null,null,null,null,null,null,null,null,null,null,null,null,null,null,"Match","Row","Col","Address","Group","Match nr.","Table","Scheduled time","Target","Notes","Start time","End time","Duration","P1 Name","P1 Code","P1 Score","P1 State","P2 Name","P2 Code","P2 Score","P2 State","Match State","Is Valid"]
["Skupina",2,null,null,null,null,1,1,1,{"$f":"((H2-1)*$B$3)+I2","v":1},2,7,null,null,{"$f":"G2","v":1},{"$f":"H2","v":1},{"$f":"I2+1","v":2},{"$f":"((P2-1)*$B$3)+Q2","v":2},3,6,null,null,{"$f":"O2","v":1},{"$f":"P2","v":1},{"$f":"Q2+1","v":3},{"$f":"((X2-1)*$B$3)+Y2","v":3},4,5,null,null,{"$f":"W2","v":1},{"$f":"X2","v":1},{"$f":"Y2+1","v":4},{"$f":"((AF2-1)*$B$3)+AG2","v":4},1,8,null,null,null,null,null,null,null,null,null,null,null,null,null,null,null,null,null,null,null,null,null,null,null,null,null,null,null,null,null,null,null,null,null,null,null,null,null,null,null,null,null,null,1,{"$f":"ROW(H4)","v":4},{"$f":"COLUMN(H4)","v":8},{"$f":"ADDRESS(CB2,CC2)","v":"$H$4"},{"$f":"CONCATENATE($B$2)","v":"2"},{"$f":"INDIRECT(CD2)","v":1},{"$f":"CONCATENATE(OFFSET(INDIRECT(CD2),2,0))","v":""},{"$f":"OFFSET(INDIRECT(CD2),-1,1)","v":"09:00:00"},{"$f":"OFFSET(INDIRECT(CD2),-1,4)","v":0},{"$f":"CONCATENATE(OFFSET(INDIRECT(CD2),-1,2))","v":""},{"$f":"OFFSET(INDIRECT(CD2),2,1)","v":"00:00:00"},{"$f":"OFFSET(INDIRECT(CD2),2,2)","v":"00:00:00"},{"$f":"OFFSET(INDIRECT(CD2),2,3)","v":"00:00:00"},{"$f":"OFFSET(INDIRECT(CD2),0,1)","v":""},{"$f":"VLOOKUP(CN2,AnnouncementListCompetitors,6,FALSE)","v":0},{"$f":"OFFSET(INDIRECT(CD2),0,4)","v":0},{"$f":"OFFSET(INDIRECT(CD2),0,5)","v":0},{"$f":"OFFSET(INDIRECT(CD2),1,1)","v":""},{"$f":"VLOOKUP(CR2,AnnouncementListCompetitors,6,FALSE)","v":0},{"$f":"OFFSET(INDIRECT(CD2),1,4)","v":0},{"$f":"OFFSET(INDIRECT(CD2),1,5)","v":0},{"$f":"OFFSET(INDIRECT(CD2),2,4)","v":0},{"$f":"IF(OFFSET(INDIRECT(CD2),2,5)=1,TRUE,FALSE)","v":false}]
["Št. dvobojev na kolo",4,null,null,null,null,{"$f":"CELL(\"address\",OFFSET($A$5,K2,0))","v":"$A$7"},{"$f":"IF(AND(NOT(ISBLANK(I4)),I4<>UnsetMatchCompetitorText,I4<>AwaitingMatchCompetitorText,NOT(ISBLANK(I5)),I5<>UnsetMatchCompetitorText,I5<>AwaitingMatchCompetitorText),1,IF(AND(I4<>AwaitingMatchCompetitorText,I5<>AwaitingMatchCompetitorText),-1,0))","v":1},"09:00:00",null,null,null,null,null,{"$f":"CELL(\"address\",OFFSET($A$5,S2,0))","v":"$A$8"},{"$f":"IF(AND(NOT(ISBLANK(Q4)),Q4<>UnsetMatchCompetitorText,Q4<>AwaitingMatchCompetitorText,NOT(ISBLANK(Q5)),Q5<>UnsetMatchCompetitorText,Q5<>AwaitingMatchCompetitorText),1,IF(AND(Q4<>AwaitingMatchCompetitorText,Q5<>AwaitingMatchCompetitorText),-1,0))","v":1},"09:00:00",null,null,5,null,null,{"$f":"CELL(\"address\",OFFSET($A$5,AA2,0))","v":"$A$9"},{"$f":"IF(AND(NOT(ISBLANK(Y4)),Y4<>UnsetMatchCompetitorText,Y4<>AwaitingMatchCompetitorText,NOT(ISBLANK(Y5)),Y5<>UnsetMatchCompetitorText,Y5<>AwaitingMatchCompetitorText),1,IF(AND(Y4<>AwaitingMatchCompetitorText,Y5<>AwaitingMatchCompetitorText),-1,0))","v":1},"09:00:00",null,null,5,null,null,{"$f":"CELL(\"address\",OFFSET($A$5,AI2,0))","v":"$A$6"},{"$f":"IF(AND(NOT(ISBLANK(AG4)),AG4<>UnsetMatchCompetitorText,AG4<>AwaitingMatchCompetitorText,NOT(ISBLANK(AG5)),AG5<>UnsetMatchCompetitorText,AG5<>AwaitingMatchCompetitorText),1,IF(AND(AG4<>AwaitingMatchCompetitorText,AG5<>AwaitingMatchCompetitorText),-1,0))","v":1},"09:00:00",null,null,5,null,null,null,null,null,null,null,null,null,null,null,null,null,null,null,null,null,null,"Tekmovalec","Tekme","+","-","+/-","Zmage","Poz.","Uvrst.","Žreb",null,null,"R",null,"S",null,null,null,null,null,null,null,null,null,null,2,{"$f":"CB2","v":4},{"$f":"CC2+8","v":16},"$P$4",{"$f":"CONCATENATE($B$2)","v":"2"},2,"4","09:00:00",5,"","13:27:00","14:45:00","01:18:00","Beno MESSNER",538,4,"L","Matej BRAJKOVIČ",440,5,"W","F",true]
[null,null,null,null,null,null,"*",{"$f":"J2","v":1},{"$f":"IF(G4=\"*\",IF(AND(OFFSET(INDIRECT(G3),0,0)>0,NOT(ISNA(OFFSET(INDIRECT(G3),0,1)))),OFFSET(INDIRECT(G3),0,1),UnsetMatchCompetitorText),IF(OFFSET(INDIRECT(G3),2,5)>0,IF(COUNTIF(INDIRECT(G4),(OFFSET(INDIRECT(G3),0,5)))>0,OFFSET(INDIRECT(G3),0,1),IF(COUNTIF(INDIRECT(G4),(OFFSET(INDIRECT(G3),1,5)))>0,OFFSET(INDIRECT(G3),1,1),BlankMatchCompetitorText)),AwaitingMatchCompetitorText))","v":""},null,null,null,null,{"$f":"IF(M4=NormalWinState,AND(M5=NormalLoseState,L4>L5),TRUE)","v":true},"*",{"$f":"R2","v":2},{"$f":"IF(O4=\"*\",IF(AND(OFFSET(INDIRECT(O3),0,0)>0,NOT(ISNA(OFFSET(INDIRECT(O3),0,1)))),OFFSET(INDIRECT(O3),0,1),UnsetMatchCompetitorText),IF(OFFSET(INDIRECT(O3),2,5)>0,IF(COUNTIF(INDIRECT(O4),(OFFSET(INDIRECT(O3),0,5)))>0,OFFSET(INDIRECT(O3),0,1),IF(COUNTIF(INDIRECT(O4),(OFFSET(INDIRECT(O3),1,5)))>0,OFFSET(INDIRECT(O3),1,1),BlankMatchCompetitorText)),AwaitingMatchCompetitorText))","v":"Beno MESSNER"},null,null,4,"L",{"$f":"IF(U4=NormalWinState,AND(U5=NormalLoseState,T4>T5),TRUE)","v":true},"*",{"$f":"Z2","v":3},{"$f":"IF(W4=\"*\",IF(AND(OFFSET(INDIRECT(W3),0,0)>0,NOT(ISNA(OFFSET(INDIRECT(W3),0,1)))),OFFSET(INDIRECT(W3),0,1),UnsetMatchCompetitorText),IF(OFFSET(INDIRECT(W3),2,5)>0,IF(COUNTIF(INDIRECT(W4),(OFFSET(INDIRECT(W3),0,5)))>0,OFFSET(INDIRECT(W3),0,1),IF(COUNTIF(INDIRECT(W4),(OFFSET(INDIRECT(W3),1,5)))>0,OFFSET(INDIRECT(W3),1,1),BlankMatchCompetitorText)),AwaitingMatchCompetitorText))","v":"Kristijan NIKL"},null,null,2,"L",{"$f":"IF(AC4=NormalWinState,AND(AC5=NormalLoseState,AB4>AB5),TRUE)","v":true},"*",{"$f":"AH2","v":4},{"$f":"IF(AE4=\"*\",IF(AND(OFFSET(INDIRECT(AE3),0,0)>0,NOT(ISNA(OFFSET(INDIRECT(AE3),0,1)))),OFFSET(INDIRECT(AE3),0,1),UnsetMatchCompetitorText),IF(OFFSET(INDIRECT(AE3),2,5)>0,IF(COUNTIF(INDIRECT(AE4),(OFFSET(INDIRECT(AE3),0,5)))>0,OFFSET(INDIRECT(AE3),0,1),IF(COUNTIF(INDIRECT(AE4),(OFFSET(INDIRECT(AE3),1,5)))>0,OFFSET(INDIRECT(AE3),1,1),BlankMatchCompetitorText)),AwaitingMatchCompetitorText))","v":"Janez LAVRIČ"},null,null,5,"W",{"$f":"IF(AK4=NormalWinState,AND(AK5=NormalLoseState,AJ4>AJ5),TRUE)","v":true},null,null,null,null,null,null,null,null,null,null,null,null,null,null,null,null,{"$f":"B6","v":"Janez LAVRIČ"},{"$f":"IF(COUNTIF(FinishedMatchStates,AJ6),1,0)+IF(L12=FinishedMatchStates,1,0)+IF(L18=FinishedMatchStates,1,0)+IF(L24=FinishedMatchStates,1,0)+IF(L30=FinishedMatchStates,1,0)+IF(L36=FinishedMatchStates,1,0)+IF(L42=FinishedMatchStates,1,0)","v":5},{"$f":"AJ4+L10+L17+L22+L29+L34+L41","v":17},{"$f":"AJ5+L11+L16+L23+L28+L35+L40","v":22},{"$f":"BE4-BF4","v":-5},{"$f":"IF(COUNTIF(WinStates,AK4),1,0)+IF(COUNTIF(WinStates,M10),1,0)+IF(COUNTIF(WinStates,M17),1,0)+IF(COUNTIF(WinStates,M22),1,0)+IF(COUNTIF(WinStates,M29),1,0)+IF(COUNTIF(WinStates,M34),1,0)+IF(COUNTIF(WinStates,M41),1,0)","v":2},{"$f":"8-IF(BH4>=BH5,1,0)-IF(BH4>=BH6,1,0)-IF(BH4>=BH7,1,0)-IF(BH4>=BH8,1,0)-IF(BH4>=BH9,1,0)-IF(BH4>=BH10,1,0)-IF(BH4>=BH11,1,0)","v":4},null,null,null,null,{"$f":"BJ4","v":0},{"$f":"BC4","v":"Janez LAVRIČ"},{"$f":"IF(ISBLANK(BK4),\"\",BK4)","v":""},null,null,null,null,null,null,null,null,null,null,3,{"$f":"CB3","v":4},{"$f":"CC3+8","v":24},"$X$4",{"$f":"CONCATENATE($B$2)","v":"2"},3,"3","09:00:00",5,"","09:10:00","09:46:00","00:36:00","Kristijan NIKL",595,2,"L","Igor BAJSIČ",799,5,"W","F",true]
["Poz.","Tekmovalec",null,null,null,null,{"$f":"CELL(\"address\",OFFSET($A$5,L2,0))","v":"$A$12"},null,{"$f":"IF(G6=\"*\",IF(AND(OFFSET(INDIRECT(G5),0,0)>0,NOT(ISNA(OFFSET(INDIRECT(G5),0,1)))),OFFSET(INDIRECT(G5),0,1),UnsetMatchCompetitorText),IF(OFFSET(INDIRECT(G5),2,5)>0,IF(COUNTIF(INDIRECT(G6),(OFFSET(INDIRECT(G5),0,5)))>0,OFFSET(INDIRECT(G5),0,1),IF(COUNTIF(INDIRECT(G6),(OFFSET(INDIRECT(G5),1,5)))>0,OFFSET(INDIRECT(G5),1,1),BlankMatchCompetitorText)),AwaitingMatchCompetitorText))","v":""},null,null,null,null,{"$f":"IF(M5=NormalWinState,AND(M4=NormalLoseState,L5>L4),TRUE)","v":true},{"$f":"CELL(\"address\",OFFSET($A$5,T2,0))","v":"$A$11"},null,{"$f":"IF(O6=\"*\",IF(AND(OFFSET(INDIRECT(O5),0,0)>0,NOT(ISNA(OFFSET(INDIRECT(O5),0,1)))),OFFSET(INDIRECT(O5),0,1),UnsetMatchCompetitorText),IF(OFFSET(INDIRECT(O5),2,5)>0,IF(COUNTIF(INDIRECT(O6),(OFFSET(INDIRECT(O5),0,5)))>0,OFFSET(INDIRECT(O5),0,1),IF(COUNTIF(INDIRECT(O6),(OFFSET(INDIRECT(O5),1,5)))>0,OFFSET(INDIRECT(O5),1,1),BlankMatchCompetitorText)),AwaitingMatchCompetitorText))","v":"Matej BRAJKOVIČ"},null,null,5,"W",{"$f":"IF(U5=NormalWinState,AND(U4=NormalLoseState,T5>T4),TRUE)","v":true},{"$f":"CELL(\"address\",OFFSET($A$5,AB2,0))","v":"$A$10"},null,{"$f":"IF(W6=\"*\",IF(AND(OFFSET(INDIRECT(W5),0,0)>0,NOT(ISNA(OFFSET(INDIRECT(W5),0,1)))),OFFSET(INDIRECT(W5),0,1),UnsetMatchCompetitorText),IF(OFFSET(INDIRECT(W5),2,5)>0,IF(COUNTIF(INDIRECT(W6),(OFFSET(INDIRECT(W5),0,5)))>0,OFFSET(INDIRECT(W5),0,1),IF(COUNTIF(INDIRECT(W6),(OFFSET(INDIRECT(W5),1,5)))>0,OFFSET(INDIRECT(W5),1,1),BlankMatchCompetitorText)),AwaitingMatchCompetitorText))","v":"Igor BAJSIČ"},null,null,5,"W",{"$f":"IF(AC5=NormalWinState,AND(AC4=NormalLoseState,AB5>AB4),TRUE)","v":true},{"$f":"CELL(\"address\",OFFSET($A$5,AJ2,0))","v":"$A$13"},null,{"$f":"IF(AE6=\"*\",IF(AND(OFFSET(INDIRECT(AE5),0,0)>0,NOT(ISNA(OFFSET(INDIRECT(AE5),0,1)))),OFFSET(INDIRECT(AE5),0,1),UnsetMatchCompetitorText),IF(OFFSET(INDIRECT(AE5),2,5)>0,IF(COUNTIF(INDIRECT(AE6),(OFFSET(INDIRECT(AE5),0,5)))>0,OFFSET(INDIRECT(AE5),0,1),IF(COUNTIF(INDIRECT(AE6),(OFFSET(INDIRECT(AE5),1,5)))>0,OFFSET(INDIRECT(AE5),1,1),BlankMatchCompetitorText)),AwaitingMatchCompetitorText))","v":"Jan HVALEC"},null,null,3,"L",{"$f":"IF(AK5=NormalWinState,AND(AK4=NormalLoseState,AJ5>AJ4),TRUE)","v":true},null,null,null,null,null,null,null,null,null,null,null,null,null,null,null,null,"",{"$f":"IF(L6=FinishedMatchStates,1,0)+IF(L12=FinishedMatchStates,1,0)+IF(AJ18=FinishedMatchStates,1,0)+IF(T24=FinishedMatchStates,1,0)+IF(T30=FinishedMatchStates,1,0)+IF(T36=FinishedMatchStates,1,0)+IF(T42=FinishedMatchStates,1,0)","v":0},{"$f":"L4+L11+AJ16+T22+T29+T34+T41","v":0},{"$f":"L5+L10+AJ17+T23+T28+T35+T40","v":0},0,{"$f":"IF(COUNTIF(WinStates,M4),1,0)+IF(COUNTIF(WinStates,M11),1,0)+IF(COUNTIF(WinStates,AK16),1,0)+IF(COUNTIF(WinStates,U22),1,0)+IF(COUNTIF(WinStates,U29),1,0)+IF(COUNTIF(WinStates,U34),1,0)+IF(COUNTIF(WinStates,U41),1,0)","v":0},{"$f":"8-IF(BH5>=BH4,1,0)-IF(BH5>=BH6,1,0)-IF(BH5>=BH7,1,0)-IF(BH5>=BH8,1,0)-IF(BH5>=BH9,1,0)-IF(BH5>=BH10,1,0)-IF(BH5>=BH11,1,0)","v":6},null,null,null,null,{"$f":"BJ5","v":0},{"$f":"BC5","v":""},"",null,null,null,null,null,null,null,null,null,null,4,{"$f":"CB4","v":4},{"$f":"CC4+8","v":32},"$AF$4",{"$f":"CONCATENATE($B$2)","v":"2"},4,"4","09:00:00",5,"","09:07:00","10:08:00","01:01:00","Janez LAVRIČ",914,5,"W","Jan HVALEC",919,3,"L","F",true]
[{"$f":"($B$2-1)*TournamentGroupSize+1","v":9},{"$f":"VLOOKUP(A6,DrawSheetPositionCompetitorsQualification,2,FALSE)","v":"Janez LAVRIČ"},null,null,null,null,"*",null,null,null,null,null,{"$f":"IF(AND(COUNTIF(FinishedMatchStates,L6),NOT(ISNA(VLOOKUP(M4,MatchCompetitorStateCodes,1,FALSE))),NOT(ISNA(VLOOKUP(M5,MatchCompetitorStateCodes,1,FALSE))),COUNTIF(WinStates,M4)+COUNTIF(WinStates,M5)<=1,COUNTIF(LoseStates,M4)+COUNTIF(LoseStates,M5)<=1,IF(M4=NormalWinState,AND(M5=NormalLoseState,L4>L5),TRUE),IF(M5=NormalWinState,AND(M4=NormalLoseState,L5>L4),TRUE),NOT(ISBLANK(L3)),NOT(ISBLANK(I3)),NOT(ISBLANK(I6)),NOT(ISBLANK(J6)),H3>0),1,IF(COUNTIF(FinishedMatchStates,L6)>0,-1,0))","v":0},null,"*",4,"13:27:00","14:45:00",{"$f":"IF(ISBLANK(Q6),\"\",IF(ISBLANK(R6),CurrentTime-Q6,R6-Q6))","v":"01:18:00"},"F",{"$f":"IF(AND(COUNTIF(FinishedMatchStates,T6),NOT(ISNA(VLOOKUP(U4,MatchCompetitorStateCodes,1,FALSE))),NOT(ISNA(VLOOKUP(U5,MatchCompetitorStateCodes,1,FALSE))),COUNTIF(WinStates,U4)+COUNTIF(WinStates,U5)<=1,COUNTIF(LoseStates,U4)+COUNTIF(LoseStates,U5)<=1,IF(U4=NormalWinState,AND(U5=NormalLoseState,T4>T5),TRUE),IF(U5=NormalWinState,AND(U4=NormalLoseState,T5>T4),TRUE),NOT(ISBLANK(T3)),NOT(ISBLANK(Q3)),NOT(ISBLANK(Q6)),NOT(ISBLANK(R6)),P3>0),1,IF(COUNTIF(FinishedMatchStates,T6)>0,-1,0))","v":1},null,"*",3,"09:10:00","09:46:00",{"$f":"IF(ISBLANK(Y6),\"\",IF(ISBLANK(Z6),CurrentTime-Y6,Z6-Y6))","v":"00:36:00"},"F",{"$f":"IF(AND(COUNTIF(FinishedMatchStates,AB6),NOT(ISNA(VLOOKUP(AC4,MatchCompetitorStateCodes,1,FALSE))),NOT(ISNA(VLOOKUP(AC5,MatchCompetitorStateCodes,1,FALSE))),COUNTIF(WinStates,AC4)+COUNTIF(WinStates,AC5)<=1,COUNTIF(LoseStates,AC4)+COUNTIF(LoseStates,AC5)<=1,IF(AC4=NormalWinState,AND(AC5=NormalLoseState,AB4>AB5),TRUE),IF(AC5=NormalWinState,AND(AC4=NormalLoseState,AB5>AB4),TRUE),NOT(ISBLANK(AB3)),NOT(ISBLANK(Y3)),NOT(ISBLANK(Y6)),NOT(ISBLANK(Z6)),X3>0),1,IF(COUNTIF(FinishedMatchStates,AB6)>0,-1,0))","v":1},null,"*",4,"09:07:00","10:08:00",{"$f":"IF(ISBLANK(AG6),\"\",IF(ISBLANK(AH6),CurrentTime-AG6,AH6-AG6))","v":"01:01:00"},"F",{"$f":"IF(AND(COUNTIF(FinishedMatchStates,AJ6),NOT(ISNA(VLOOKUP(AK4,MatchCompetitorStateCodes,1,FALSE))),NOT(ISNA(VLOOKUP(AK5,MatchCompetitorStateCodes,1,FALSE))),COUNTIF(WinStates,AK4)+COUNTIF(WinStates,AK5)<=1,COUNTIF(LoseStates,AK4)+COUNTIF(LoseStates,AK5)<=1,IF(AK4=NormalWinState,AND(AK5=NormalLoseState,AJ4>AJ5),TRUE),IF(AK5=NormalWinState,AND(AK4=NormalLoseState,AJ5>AJ4),TRUE),NOT(ISBLANK(AJ3)),NOT(ISBLANK(AG3)),NOT(ISBLANK(AG6)),NOT(ISBLANK(AH6)),AF3>0),1,IF(COUNTIF(FinishedMatchStates,AJ6)>0,-1,0))","v":1},null,null,null,null,null,null,null,null,null,null,null,null,null,null,null,null,null,"Beno MESSNER",{"$f":"IF(T6=FinishedMatchStates,1,0)+IF(T12=FinishedMatchStates,1,0)+IF(L18=FinishedMatchStates,1,0)+IF(T24=FinishedMatchStates,1,0)+IF(AJ30=FinishedMatchStates,1,0)+IF(AB36=FinishedMatchStates,1,0)+IF(AB42=FinishedMatchStates,1,0)","v":5},{"$f":"T4+T11+L16+T23+AJ28+AB34+AB41","v":20},{"$f":"T5+T10+L17+T22+AJ29+AB35+AB40","v":20},0,{"$f":"IF(COUNTIF(WinStates,U4),1,0)+IF(COUNTIF(WinStates,U11),1,0)+IF(COUNTIF(WinStates,M16),1,0)+IF(COUNTIF(WinStates,U23),1,0)+IF(COUNTIF(WinStates,AK28),1,0)+IF(COUNTIF(WinStates,AC34),1,0)+IF(COUNTIF(WinStates,AC41),1,0)","v":1},{"$f":"8-IF(BH6>=BH5,1,0)-IF(BH6>=BH4,1,0)-IF(BH6>=BH7,1,0)-IF(BH6>=BH8,1,0)-IF(BH6>=BH9,1,0)-IF(BH6>=BH10,1,0)-IF(BH6>=BH11,1,0)","v":5},null,null,null,null,0,"Beno MESSNER",{"$f":"IF(ISBLANK(BK6),\"\",BK6)","v":""},null,null,null,null,null,null,null,null,null,null,5,{"$f":"CB2+6","v":10},{"$f":"CC2","v":8},"$H$10",{"$f":"CONCATENATE($B$2)","v":"2"},5,"","09:00:00",0,"","00:00:00","00:00:00","","Janez LAVRIČ",914,0,0,"",0,0,0,0,false]
[{"$f":"A6+1","v":10},"",null,null,null,null,null,null,null,null,null,null,null,null,null,null,null,null,null,null,null,null,null,null,null,null,null,null,null,null,null,null,null,null,null,null,null,null,null,null,null,null,null,null,null,null,null,null,null,null,null,null,null,null,"Kristijan NIKL",{"$f":"IF(AB6=FinishedMatchStates,1,0)+IF(AB12=FinishedMatchStates,1,0)+IF(T18=FinishedMatchStates,1,0)+IF(L24=FinishedMatchStates,1,0)+IF(T30=FinishedMatchStates,1,0)+IF(AB36=FinishedMatchStates,1,0)+IF(AJ42=FinishedMatchStates,1,0)","v":5},{"$f":"AB4+AB11+T16+L23+T28+AB35+AJ40","v":17},{"$f":"AB5+AB10+T17+L22+T29+AB34+AJ41","v":18},-1,{"$f":"IF(COUNTIF(WinStates,AC4),1,0)+IF(COUNTIF(WinStates,AC11),1,0)+IF(COUNTIF(WinStates,U16),1,0)+IF(COUNTIF(WinStates,M23),1,0)+IF(COUNTIF(WinStates,U28),1,0)+IF(COUNTIF(WinStates,AC35),1,0)+IF(COUNTIF(WinStates,AK40),1,0)","v":3},{"$f":"8-IF(BH7>=BH5,1,0)-IF(BH7>=BH6,1,0)-IF(BH7>=BH4,1,0)-IF(BH7>=BH8,1,0)-IF(BH7>=BH9,1,0)-IF(BH7>=BH10,1,0)-IF(BH7>=BH11,1,0)","v":3},null,null,null,null,0,"Kristijan NIKL",{"$f":"IF(ISBLANK(BK7),\"\",BK7)","v":""},null,null,null,null,null,null,null,null,null,null,6,{"$f":"CB6","v":10},{"$f":"CC6+8","v":16},"$P$10",{"$f":"CONCATENATE($B$2)","v":"2"},6,"","09:00:00",0,"","00:00:00","00:00:00","","",0,0,0,"Beno MESSNER",538,0,0,0,false]
[{"$f":"A7+1","v":11},"Beno MESSNER",null,null,null,null,{"$f":"G2","v":1},{"$f":"H2+1","v":2},{"$f":"I2","v":1},{"$f":"((H8-1)*$B$3)+I8","v":5},1,2,null,null,{"$f":"G8","v":1},{"$f":"H8","v":2},{"$f":"I8+1","v":2},{"$f":"((P8-1)*$B$3)+Q8","v":6},7,3,null,null,{"$f":"O8","v":1},{"$f":"P8","v":2},{"$f":"Q8+1","v":3},{"$f":"((X8-1)*$B$3)+Y8","v":7},6,4,null,null,{"$f":"W8","v":1},{"$f":"X8","v":2},{"$f":"Y8+1","v":4},{"$f":"((AF8-1)*$B$3)+AG8","v":8},8,5,null,null,null,null,null,null,null,null,null,null,null,null,null,null,null,null,null,null,"Igor BAJSIČ",{"$f":"IF(AB6=FinishedMatchStates,1,0)+IF(AJ12=FinishedMatchStates,1,0)+IF(AB18=FinishedMatchStates,1,0)+IF(AB24=FinishedMatchStates,1,0)+IF(L30=FinishedMatchStates,1,0)+IF(T36=FinishedMatchStates,1,0)+IF(AB42=FinishedMatchStates,1,0)","v":5},{"$f":"AB5+AJ11+AB16+AB23+L28+T35+AB40","v":23},{"$f":"AB4+AJ10+AB17+AB22+L29+T34+AB41","v":17},6,{"$f":"IF(COUNTIF(WinStates,AC5),1,0)+IF(COUNTIF(WinStates,AK11),1,0)+IF(COUNTIF(WinStates,AC16),1,0)+IF(COUNTIF(WinStates,AC23),1,0)+IF(COUNTIF(WinStates,M28),1,0)+IF(COUNTIF(WinStates,U35),1,0)+IF(COUNTIF(WinStates,AC40),1,0)","v":4},{"$f":"8-IF(BH8>=BH5,1,0)-IF(BH8>=BH6,1,0)-IF(BH8>=BH7,1,0)-IF(BH8>=BH4,1,0)-IF(BH8>=BH9,1,0)-IF(BH8>=BH10,1,0)-IF(BH8>=BH11,1,0)","v":2},2,null,null,null,2,"Igor BAJSIČ","",null,null,null,null,null,null,null,null,null,null,7,{"$f":"CB7","v":10},{"$f":"CC7+8","v":24},"$X$10",{"$f":"CONCATENATE($B$2)","v":"2"},7,"3","09:00:00",5,"","09:55:00","10:28:00","00:33:00","Matej BRAJKOVIČ",440,5,"W","Kristijan NIKL",595,0,"L","F",true]
[12,"Kristijan NIKL",null,null,null,null,{"$f":"CELL(\"address\",OFFSET($A$5,K8,0))","v":"$A$6"},{"$f":"IF(AND(NOT(ISBLANK(I10)),I10<>UnsetMatchCompetitorText,I10<>AwaitingMatchCompetitorText,NOT(ISBLANK(I11)),I11<>UnsetMatchCompetitorText,I11<>AwaitingMatchCompetitorText),1,IF(AND(I10<>AwaitingMatchCompetitorText,I11<>AwaitingMatchCompetitorText),-1,0))","v":1},"09:00:00",null,null,null,null,null,{"$f":"CELL(\"address\",OFFSET($A$5,S8,0))","v":"$A$12"},{"$f":"IF(AND(NOT(ISBLANK(Q10)),Q10<>UnsetMatchCompetitorText,Q10<>AwaitingMatchCompetitorText,NOT(ISBLANK(Q11)),Q11<>UnsetMatchCompetitorText,Q11<>AwaitingMatchCompetitorText),1,IF(AND(Q10<>AwaitingMatchCompetitorText,Q11<>AwaitingMatchCompetitorText),-1,0))","v":1},"09:00:00",null,null,null,null,null,{"$f":"CELL(\"address\",OFFSET($A$5,AA8,0))","v":"$A$11"},{"$f":"IF(AND(NOT(ISBLANK(Y10)),Y10<>UnsetMatchCompetitorText,Y10<>AwaitingMatchCompetitorText,NOT(ISBLANK(Y11)),Y11<>UnsetMatchCompetitorText,Y11<>AwaitingMatchCompetitorText),1,IF(AND(Y10<>AwaitingMatchCompetitorText,Y11<>AwaitingMatchCompetitorText),-1,0))","v":1},"09:00:00",null,null,5,null,null,{"$f":"CELL(\"address\",OFFSET($A$5,AI8,0))","v":"$A$13"},{"$f":"IF(AND(NOT(ISBLANK(AG10)),AG10<>UnsetMatchCompetitorText,AG10<>AwaitingMatchCompetitorText,NOT(ISBLANK(AG11)),AG11<>UnsetMatchCompetitorText,AG11<>AwaitingMatchCompetitorText),1,IF(AND(AG10<>AwaitingMatchCompetitorText,AG11<>AwaitingMatchCompetitorText),-1,0))","v":1},"09:00:00",null,null,5,null,null,null,null,null,null,null,null,null,null,null,null,null,null,null,null,null,null,"Matej BRAJKOVIČ",{"$f":"IF(T6=FinishedMatchStates,1,0)+IF(AB12=FinishedMatchStates,1,0)+IF(AB18=FinishedMatchStates,1,0)+IF(AJ24=FinishedMatchStates,1,0)+IF(AB30=FinishedMatchStates,1,0)+IF(L36=FinishedMatchStates,1,0)+IF(T42=FinishedMatchStates,1,0)","v":5},{"$f":"T5+AB10+AB17+AJ23+AB28+L35+T40","v":25},{"$f":"T4+AB11+AB16+AJ22+AB29+L34+T41","v":9},16,{"$f":"IF(COUNTIF(WinStates,U5),1,0)+IF(COUNTIF(WinStates,AC10),1,0)+IF(COUNTIF(WinStates,AC17),1,0)+IF(COUNTIF(WinStates,AK23),1,0)+IF(COUNTIF(WinStates,AC28),1,0)+IF(COUNTIF(WinStates,M35),1,0)+IF(COUNTIF(WinStates,U40),1,0)","v":5},{"$f":"8-IF(BH9>=BH5,1,0)-IF(BH9>=BH6,1,0)-IF(BH9>=BH7,1,0)-IF(BH9>=BH8,1,0)-IF(BH9>=BH4,1,0)-IF(BH9>=BH10,1,0)-IF(BH9>=BH11,1,0)","v":1},1,null,null,null,1,"Matej BRAJKOVIČ","",null,null,null,null,null,null,null,null,null,null,8,{"$f":"CB8","v":10},{"$f":"CC8+8","v":32},"$AF$10",{"$f":"CONCATENATE($B$2)","v":"2"},8,"3","09:00:00",5,"","11:46:00","12:28:00","00:42:00","Jan HVALEC",919,4,"L","Igor BAJSIČ",799,5,"W","F",true]
[13,"Igor BAJSIČ",null,null,null,null,"*",{"$f":"J8","v":5},{"$f":"IF(G10=\"*\",IF(AND(OFFSET(INDIRECT(G9),0,0)>0,NOT(ISNA(OFFSET(INDIRECT(G9),0,1)))),OFFSET(INDIRECT(G9),0,1),UnsetMatchCompetitorText),IF(OFFSET(INDIRECT(G9),2,5)>0,IF(COUNTIF(INDIRECT(G10),(OFFSET(INDIRECT(G9),0,5)))>0,OFFSET(INDIRECT(G9),0,1),IF(COUNTIF(INDIRECT(G10),(OFFSET(INDIRECT(G9),1,5)))>0,OFFSET(INDIRECT(G9),1,1),BlankMatchCompetitorText)),AwaitingMatchCompetitorText))","v":"Janez LAVRIČ"},null,null,null,null,{"$f":"IF(M10=NormalWinState,AND(M11=NormalLoseState,L10>L11),TRUE)","v":true},"*",{"$f":"R8","v":6},{"$f":"IF(O10=\"*\",IF(AND(OFFSET(INDIRECT(O9),0,0)>0,NOT(ISNA(OFFSET(INDIRECT(O9),0,1)))),OFFSET(INDIRECT(O9),0,1),UnsetMatchCompetitorText),IF(OFFSET(INDIRECT(O9),2,5)>0,IF(COUNTIF(INDIRECT(O10),(OFFSET(INDIRECT(O9),0,5)))>0,OFFSET(INDIRECT(O9),0,1),IF(COUNTIF(INDIRECT(O10),(OFFSET(INDIRECT(O9),1,5)))>0,OFFSET(INDIRECT(O9),1,1),BlankMatchCompetitorText)),AwaitingMatchCompetitorText))","v":""},null,null,null,null,{"$f":"IF(U10=NormalWinState,AND(U11=NormalLoseState,T10>T11),TRUE)","v":true},"*",{"$f":"Z8","v":7},{"$f":"IF(W10=\"*\",IF(AND(OFFSET(INDIRECT(W9),0,0)>0,NOT(ISNA(OFFSET(INDIRECT(W9),0,1)))),OFFSET(INDIRECT(W9),0,1),UnsetMatchCompetitorText),IF(OFFSET(INDIRECT(W9),2,5)>0,IF(COUNTIF(INDIRECT(W10),(OFFSET(INDIRECT(W9),0,5)))>0,OFFSET(INDIRECT(W9),0,1),IF(COUNTIF(INDIRECT(W10),(OFFSET(INDIRECT(W9),1,5)))>0,OFFSET(INDIRECT(W9),1,1),BlankMatchCompetitorText)),AwaitingMatchCompetitorText))","v":"Matej BRAJKOVIČ"},null,null,5,"W",{"$f":"IF(AC10=NormalWinState,AND(AC11=NormalLoseState,AB10>AB11),TRUE)","v":true},"*",{"$f":"AH8","v":8},{"$f":"IF(AE10=\"*\",IF(AND(OFFSET(INDIRECT(AE9),0,0)>0,NOT(ISNA(OFFSET(INDIRECT(AE9),0,1)))),OFFSET(INDIRECT(AE9),0,1),UnsetMatchCompetitorText),IF(OFFSET(INDIRECT(AE9),2,5)>0,IF(COUNTIF(INDIRECT(AE10),(OFFSET(INDIRECT(AE9),0,5)))>0,OFFSET(INDIRECT(AE9),0,1),IF(COUNTIF(INDIRECT(AE10),(OFFSET(INDIRECT(AE9),1,5)))>0,OFFSET(INDIRECT(AE9),1,1),BlankMatchCompetitorText)),AwaitingMatchCompetitorText))","v":"Jan HVALEC"},null,null,4,"L",{"$f":"IF(AK10=NormalWinState,AND(AK11=NormalLoseState,AJ10>AJ11),TRUE)","v":true},null,null,null,null,null,null,null,null,null,null,null,null,null,null,null,null,"",{"$f":"IF(L6=FinishedMatchStates,1,0)+IF(T12=FinishedMatchStates,1,0)+IF(T18=FinishedMatchStates,1,0)+IF(AB24=FinishedMatchStates,1,0)+IF(AB30=FinishedMatchStates,1,0)+IF(AJ36=FinishedMatchStates,1,0)+IF(L42=FinishedMatchStates,1,0)","v":0},{"$f":"L5+T10+T17+AB22+AB29+AJ35+L40","v":0},{"$f":"L4+T11+T16+AB23+AB28+AJ34+L41","v":0},{"$f":"BE10-BF10","v":0},{"$f":"IF(COUNTIF(WinStates,M5),1,0)+IF(COUNTIF(WinStates,U10),1,0)+IF(COUNTIF(WinStates,U17),1,0)+IF(COUNTIF(WinStates,AC22),1,0)+IF(COUNTIF(WinStates,AC29),1,0)+IF(COUNTIF(WinStates,AK35),1,0)+IF(COUNTIF(WinStates,M40),1,0)","v":0},{"$f":"8-IF(BH10>=BH6,1,0)-IF(BH10>=BH7,1,0)-IF(BH10>=BH8,1,0)-IF(BH10>=BH9,1,0)-IF(BH10>=BH5,1,0)-IF(BH10>=BH11,1,0)-IF(BH10>=BH4,1,0)","v":6},null,null,null,null,0,"","",null,null,null,null,null,null,null,null,null,null,9,{"$f":"CB6+6","v":16},{"$f":"CC6","v":8},"$H$16","2",9,"4","09:00:00",5,"","10:46:00","11:55:00","01:09:00","Beno MESSNER",538,4,"L","Janez LAVRIČ",914,5,"W","F",true]
[14,"Matej BRAJKOVIČ",null,null,null,null,{"$f":"CELL(\"address\",OFFSET($A$5,L8,0))","v":"$A$7"},null,{"$f":"IF(G12=\"*\",IF(AND(OFFSET(INDIRECT(G11),0,0)>0,NOT(ISNA(OFFSET(INDIRECT(G11),0,1)))),OFFSET(INDIRECT(G11),0,1),UnsetMatchCompetitorText),IF(OFFSET(INDIRECT(G11),2,5)>0,IF(COUNTIF(INDIRECT(G12),(OFFSET(INDIRECT(G11),0,5)))>0,OFFSET(INDIRECT(G11),0,1),IF(COUNTIF(INDIRECT(G12),(OFFSET(INDIRECT(G11),1,5)))>0,OFFSET(INDIRECT(G11),1,1),BlankMatchCompetitorText)),AwaitingMatchCompetitorText))","v":""},null,null,null,null,{"$f":"IF(M11=NormalWinState,AND(M10=NormalLoseState,L11>L10),TRUE)","v":true},{"$f":"CELL(\"address\",OFFSET($A$5,T8,0))","v":"$A$8"},null,{"$f":"IF(O12=\"*\",IF(AND(OFFSET(INDIRECT(O11),0,0)>0,NOT(ISNA(OFFSET(INDIRECT(O11),0,1)))),OFFSET(INDIRECT(O11),0,1),UnsetMatchCompetitorText),IF(OFFSET(INDIRECT(O11),2,5)>0,IF(COUNTIF(INDIRECT(O12),(OFFSET(INDIRECT(O11),0,5)))>0,OFFSET(INDIRECT(O11),0,1),IF(COUNTIF(INDIRECT(O12),(OFFSET(INDIRECT(O11),1,5)))>0,OFFSET(INDIRECT(O11),1,1),BlankMatchCompetitorText)),AwaitingMatchCompetitorText))","v":"Beno MESSNER"},null,null,null,null,{"$f":"IF(U11=NormalWinState,AND(U10=NormalLoseState,T11>T10),TRUE)","v":true},{"$f":"CELL(\"address\",OFFSET($A$5,AB8,0))","v":"$A$9"},null,{"$f":"IF(W12=\"*\",IF(AND(OFFSET(INDIRECT(W11),0,0)>0,NOT(ISNA(OFFSET(INDIRECT(W11),0,1)))),OFFSET(INDIRECT(W11),0,1),UnsetMatchCompetitorText),IF(OFFSET(INDIRECT(W11),2,5)>0,IF(COUNTIF(INDIRECT(W12),(OFFSET(INDIRECT(W11),0,5)))>0,OFFSET(INDIRECT(W11),0,1),IF(COUNTIF(INDIRECT(W12),(OFFSET(INDIRECT(W11),1,5)))>0,OFFSET(INDIRECT(W11),1,1),BlankMatchCompetitorText)),AwaitingMatchCompetitorText))","v":"Kristijan NIKL"},null,null,0,"L",{"$f":"IF(AC11=NormalWinState,AND(AC10=NormalLoseState,AB11>AB10),TRUE)","v":true},{"$f":"CELL(\"address\",OFFSET($A$5,AJ8,0))","v":"$A$10"},null,{"$f":"IF(AE12=\"*\",IF(AND(OFFSET(INDIRECT(AE11),0,0)>0,NOT(ISNA(OFFSET(INDIRECT(AE11),0,1)))),OFFSET(INDIRECT(AE11),0,1),UnsetMatchCompetitorText),IF(OFFSET(INDIRECT(AE11),2,5)>0,IF(COUNTIF(INDIRECT(AE12),(OFFSET(INDIRECT(AE11),0,5)))>0,OFFSET(INDIRECT(AE11),0,1),IF(COUNTIF(INDIRECT(AE12),(OFFSET(INDIRECT(AE11),1,5)))>0,OFFSET(INDIRECT(AE11),1,1),BlankMatchCompetitorText)),AwaitingMatchCompetitorText))","v":"Igor BAJSIČ"},null,null,5,"W",{"$f":"IF(AK11=NormalWinState,AND(AK10=NormalLoseState,AJ11>AJ10),TRUE)","v":true},null,null,null,null,null,null,null,null,null,null,null,null,null,null,null,null,"Jan HVALEC",{"$f":"IF(AJ6=FinishedMatchStates,1,0)+IF(AJ12=FinishedMatchStates,1,0)+IF(AJ18=FinishedMatchStates,1,0)+IF(AJ24=FinishedMatchStates,1,0)+IF(AJ30=FinishedMatchStates,1,0)+IF(AJ36=FinishedMatchStates,1,0)+IF(AJ42=FinishedMatchStates,1,0)","v":5},{"$f":"AJ5+AJ10+AJ17+AJ22+AJ29+AJ34+AJ41","v":9},{"$f":"AJ4+AJ11+AJ16+AJ23+AJ28+AJ35+AJ40","v":25},{"$f":"BE11-BF11","v":-16},{"$f":"IF(COUNTIF(WinStates,AK5),1,0)+IF(COUNTIF(WinStates,AK10),1,0)+IF(COUNTIF(WinStates,AK17),1,0)+IF(COUNTIF(WinStates,AK22),1,0)+IF(COUNTIF(WinStates,AK29),1,0)+IF(COUNTIF(WinStates,AK34),1,0)+IF(COUNTIF(WinStates,AK41),1,0)","v":0},{"$f":"8-IF(BH11>=BH7,1,0)-IF(BH11>=BH8,1,0)-IF(BH11>=BH9,1,0)-IF(BH11>=BH10,1,0)-IF(BH11>=BH6,1,0)-IF(BH11>=BH4,1,0)-IF(BH11>=BH5,1,0)","v":6},null,null,null,null,0,"Jan HVALEC","",null,null,null,null,null,null,null,null,null,null,10,{"$f":"CB10","v":16},{"$f":"CC10+8","v":16},"$P$16",{"$f":"CONCATENATE($B$2)","v":"2"},10,"","09:00:00",0,"","00:00:00","00:00:00","","Kristijan NIKL",595,0,0,"",0,0,0,0,false]
[15,"",null,null,null,null,"*",null,null,null,{"$f":"IF(ISBLANK(I12),\"\",IF(ISBLANK(J12),CurrentTime-I12,J12-I12))","v":""},null,{"$f":"IF(AND(COUNTIF(FinishedMatchStates,L12),NOT(ISNA(VLOOKUP(M10,MatchCompetitorStateCodes,1,FALSE))),NOT(ISNA(VLOOKUP(M11,MatchCompetitorStateCodes,1,FALSE))),COUNTIF(WinStates,M10)+COUNTIF(WinStates,M11)<=1,COUNTIF(LoseStates,M10)+COUNTIF(LoseStates,M11)<=1,IF(M10=NormalWinState,AND(M11=NormalLoseState,L10>L11),TRUE),IF(M11=NormalWinState,AND(M10=NormalLoseState,L11>L10),TRUE),NOT(ISBLANK(L9)),NOT(ISBLANK(I9)),NOT(ISBLANK(I12)),NOT(ISBLANK(J12)),H9>0),1,IF(COUNTIF(FinishedMatchStates,L12)>0,-1,0))","v":0},null,"*",null,null,null,{"$f":"IF(ISBLANK(Q12),\"\",IF(ISBLANK(R12),CurrentTime-Q12,R12-Q12))","v":""},null,{"$f":"IF(AND(COUNTIF(FinishedMatchStates,T12),NOT(ISNA(VLOOKUP(U10,MatchCompetitorStateCodes,1,FALSE))),NOT(ISNA(VLOOKUP(U11,MatchCompetitorStateCodes,1,FALSE))),COUNTIF(WinStates,U10)+COUNTIF(WinStates,U11)<=1,COUNTIF(LoseStates,U10)+COUNTIF(LoseStates,U11)<=1,IF(U10=NormalWinState,AND(U11=NormalLoseState,T10>T11),TRUE),IF(U11=NormalWinState,AND(U10=NormalLoseState,T11>T10),TRUE),NOT(ISBLANK(T9)),NOT(ISBLANK(Q9)),NOT(ISBLANK(Q12)),NOT(ISBLANK(R12)),P9>0),1,IF(COUNTIF(FinishedMatchStates,T12)>0,-1,0))","v":0},null,"*",3,"09:55:00","10:28:00",{"$f":"IF(ISBLANK(Y12),\"\",IF(ISBLANK(Z12),CurrentTime-Y12,Z12-Y12))","v":"00:33:00"},"F",{"$f":"IF(AND(COUNTIF(FinishedMatchStates,AB12),NOT(ISNA(VLOOKUP(AC10,MatchCompetitorStateCodes,1,FALSE))),NOT(ISNA(VLOOKUP(AC11,MatchCompetitorStateCodes,1,FALSE))),COUNTIF(WinStates,AC10)+COUNTIF(WinStates,AC11)<=1,COUNTIF(LoseStates,AC10)+COUNTIF(LoseStates,AC11)<=1,IF(AC10=NormalWinState,AND(AC11=NormalLoseState,AB10>AB11),TRUE),IF(AC11=NormalWinState,AND(AC10=NormalLoseState,AB11>AB10),TRUE),NOT(ISBLANK(AB9)),NOT(ISBLANK(Y9)),NOT(ISBLANK(Y12)),NOT(ISBLANK(Z12)),X9>0),1,IF(COUNTIF(FinishedMatchStates,AB12)>0,-1,0))","v":1},null,"*",3,"11:46:00","12:28:00",{"$f":"IF(ISBLANK(AG12),\"\",IF(ISBLANK(AH12),CurrentTime-AG12,AH12-AG12))","v":"00:42:00"},"F",{"$f":"IF(AND(COUNTIF(FinishedMatchStates,AJ12),NOT(ISNA(VLOOKUP(AK10,MatchCompetitorStateCodes,1,FALSE))),NOT(ISNA(VLOOKUP(AK11,MatchCompetitorStateCodes,1,FALSE))),COUNTIF(WinStates,AK10)+COUNTIF(WinStates,AK11)<=1,COUNTIF(LoseStates,AK10)+COUNTIF(LoseStates,AK11)<=1,IF(AK10=NormalWinState,AND(AK11=NormalLoseState,AJ10>AJ11),TRUE),IF(AK11=NormalWinState,AND(AK10=NormalLoseState,AJ11>AJ10),TRUE),NOT(ISBLANK(AJ9)),NOT(ISBLANK(AG9)),NOT(ISBLANK(AG12)),NOT(ISBLANK(AH12)),AF9>0),1,IF(COUNTIF(FinishedMatchStates,AJ12)>0,-1,0))","v":1},null,null,null,null,null,null,null,null,null,null,null,null,null,null,null,null,null,null,null,null,null,null,null,null,null,null,null,null,null,null,null,null,null,null,null,null,null,null,null,null,null,11,{"$f":"CB11","v":16},{"$f":"CC11+8","v":24},"$X$16",{"$f":"CONCATENATE($B$2)","v":"2"},11,"3","09:00:00",5,"","10:29:00","11:29:00","01:00:00","Igor BAJSIČ",799,3,"L","Matej BRAJKOVIČ",440,5,"W","F",true]
[16,"Jan HVALEC",null,null,null,null,null,null,null,null,null,null,null,null,null,null,null,null,null,null,null,null,null,null,null,null,null,null,null,null,null,null,null,null,null,null,null,null,null,null,null,null,null,null,null,null,null,null,null,null,null,null,null,null,null,null,null,null,null,null,null,null,null,null,null,null,null,null,null,null,null,null,null,null,null,null,null,null,12,{"$f":"CB12","v":16},{"$f":"CC12+8","v":32},"$AF$16",{"$f":"CONCATENATE($B$2)","v":"2"},12,"","09:00:00",0,"","00:00:00","00:00:00","","",0,0,0,"Jan HVALEC",919,0,0,0,false]
[null,null,null,null,null,null,{"$f":"G8","v":1},{"$f":"H8+1","v":3},{"$f":"I8","v":1},{"$f":"((H14-1)*$B$3)+I14","v":9},3,1,null,null,{"$f":"G14","v":1},{"$f":"H14","v":3},{"$f":"I14+1","v":2},{"$f":"((P14-1)*$B$3)+Q14","v":10},4,7,null,null,{"$f":"O14","v":1},{"$f":"P14","v":3},{"$f":"Q14+1","v":3},{"$f":"((X14-1)*$B$3)+Y14","v":11},5,6,null,null,{"$f":"W14","v":1},{"$f":"X14","v":3},{"$f":"Y14+1","v":4},{"$f":"((AF14-1)*$B$3)+AG14","v":12},2,8,null,null,null,null,null,null,null,null,null,null,null,null,null,null,null,null,null,null,null,null,null,null,null,null,null,null,null,null,null,null,null,null,null,null,null,null,null,null,null,null,null,null,13,{"$f":"CB10+6","v":22},{"$f":"CC10","v":8},"$H$22","2",13,"5","09:00:00",5,"","13:31:00","14:30:00","00:59:00","Janez LAVRIČ",914,4,"L","Kristijan NIKL",595,5,"W","F",true]
["Uvr.","Tekmovalec","Poz.","L","S",null,{"$f":"CELL(\"address\",OFFSET($A$5,K14,0))","v":"$A$8"},{"$f":"IF(AND(NOT(ISBLANK(I16)),I16<>UnsetMatchCompetitorText,I16<>AwaitingMatchCompetitorText,NOT(ISBLANK(I17)),I17<>UnsetMatchCompetitorText,I17<>AwaitingMatchCompetitorText),1,IF(AND(I16<>AwaitingMatchCompetitorText,I17<>AwaitingMatchCompetitorText),-1,0))","v":1},"09:00:00",null,null,5,null,null,{"$f":"CELL(\"address\",OFFSET($A$5,S14,0))","v":"$A$9"},{"$f":"IF(AND(NOT(ISBLANK(Q16)),Q16<>UnsetMatchCompetitorText,Q16<>AwaitingMatchCompetitorText,NOT(ISBLANK(Q17)),Q17<>UnsetMatchCompetitorText,Q17<>AwaitingMatchCompetitorText),1,IF(AND(Q16<>AwaitingMatchCompetitorText,Q17<>AwaitingMatchCompetitorText),-1,0))","v":1},"09:00:00",null,null,null,null,null,{"$f":"CELL(\"address\",OFFSET($A$5,AA14,0))","v":"$A$10"},{"$f":"IF(AND(NOT(ISBLANK(Y16)),Y16<>UnsetMatchCompetitorText,Y16<>AwaitingMatchCompetitorText,NOT(ISBLANK(Y17)),Y17<>UnsetMatchCompetitorText,Y17<>AwaitingMatchCompetitorText),1,IF(AND(Y16<>AwaitingMatchCompetitorText,Y17<>AwaitingMatchCompetitorText),-1,0))","v":1},"09:00:00",null,null,5,null,null,{"$f":"CELL(\"address\",OFFSET($A$5,AI14,0))","v":"$A$7"},{"$f":"IF(AND(NOT(ISBLANK(AG16)),AG16<>UnsetMatchCompetitorText,AG16<>AwaitingMatchCompetitorText,NOT(ISBLANK(AG17)),AG17<>UnsetMatchCompetitorText,AG17<>AwaitingMatchCompetitorText),1,IF(AND(AG16<>AwaitingMatchCompetitorText,AG17<>AwaitingMatchCompetitorText),-1,0))","v":1},"09:00:00",null,null,null,null,null,null,null,null,null,null,null,null,null,null,null,null,null,null,null,null,null,null,null,null,null,null,null,null,null,null,null,null,null,null,null,null,null,null,null,null,null,null,null,null,null,14,{"$f":"CB14","v":22},{"$f":"CC14+8","v":16},"$P$22",{"$f":"CONCATENATE($B$2)","v":"2"},14,"","09:00:00",0,"","00:00:00","00:00:00","","",0,0,0,"Beno MESSNER",538,0,0,0,false]
["Q",{"$f":"VLOOKUP(D16,BN$4:BP$11,2,)","v":"Matej BRAJKOVIČ"},{"$f":"VLOOKUP(D16,BN$4:BP$11,3,)","v":""},1,null,null,"*",{"$f":"J14","v":9},{"$f":"IF(G16=\"*\",IF(AND(OFFSET(INDIRECT(G15),0,0)>0,NOT(ISNA(OFFSET(INDIRECT(G15),0,1)))),OFFSET(INDIRECT(G15),0,1),UnsetMatchCompetitorText),IF(OFFSET(INDIRECT(G15),2,5)>0,IF(COUNTIF(INDIRECT(G16),(OFFSET(INDIRECT(G15),0,5)))>0,OFFSET(INDIRECT(G15),0,1),IF(COUNTIF(INDIRECT(G16),(OFFSET(INDIRECT(G15),1,5)))>0,OFFSET(INDIRECT(G15),1,1),BlankMatchCompetitorText)),AwaitingMatchCompetitorText))","v":"Beno MESSNER"},null,null,4,"L",{"$f":"IF(M16=NormalWinState,AND(M17=NormalLoseState,L16>L17),TRUE)","v":true},"*",{"$f":"R14","v":10},{"$f":"IF(O16=\"*\",IF(AND(OFFSET(INDIRECT(O15),0,0)>0,NOT(ISNA(OFFSET(INDIRECT(O15),0,1)))),OFFSET(INDIRECT(O15),0,1),UnsetMatchCompetitorText),IF(OFFSET(INDIRECT(O15),2,5)>0,IF(COUNTIF(INDIRECT(O16),(OFFSET(INDIRECT(O15),0,5)))>0,OFFSET(INDIRECT(O15),0,1),IF(COUNTIF(INDIRECT(O16),(OFFSET(INDIRECT(O15),1,5)))>0,OFFSET(INDIRECT(O15),1,1),BlankMatchCompetitorText)),AwaitingMatchCompetitorText))","v":"Kristijan NIKL"},null,null,null,null,{"$f":"IF(U16=NormalWinState,AND(U17=NormalLoseState,T16>T17),TRUE)","v":true},"*",{"$f":"Z14","v":11},{"$f":"IF(W16=\"*\",IF(AND(OFFSET(INDIRECT(W15),0,0)>0,NOT(ISNA(OFFSET(INDIRECT(W15),0,1)))),OFFSET(INDIRECT(W15),0,1),UnsetMatchCompetitorText),IF(OFFSET(INDIRECT(W15),2,5)>0,IF(COUNTIF(INDIRECT(W16),(OFFSET(INDIRECT(W15),0,5)))>0,OFFSET(INDIRECT(W15),0,1),IF(COUNTIF(INDIRECT(W16),(OFFSET(INDIRECT(W15),1,5)))>0,OFFSET(INDIRECT(W15),1,1),BlankMatchCompetitorText)),AwaitingMatchCompetitorText))","v":"Igor BAJSIČ"},null,null,3,"L",{"$f":"IF(AC16=NormalWinState,AND(AC17=NormalLoseState,AB16>AB17),TRUE)","v":true},"*",{"$f":"AH14","v":12},{"$f":"IF(AE16=\"*\",IF(AND(OFFSET(INDIRECT(AE15),0,0)>0,NOT(ISNA(OFFSET(INDIRECT(AE15),0,1)))),OFFSET(INDIRECT(AE15),0,1),UnsetMatchCompetitorText),IF(OFFSET(INDIRECT(AE15),2,5)>0,IF(COUNTIF(INDIRECT(AE16),(OFFSET(INDIRECT(AE15),0,5)))>0,OFFSET(INDIRECT(AE15),0,1),IF(COUNTIF(INDIRECT(AE16),(OFFSET(INDIRECT(AE15),1,5)))>0,OFFSET(INDIRECT(AE15),1,1),BlankMatchCompetitorText)),AwaitingMatchCompetitorText))","v":""},null,null,null,null,{"$f":"IF(AK16=NormalWinState,AND(AK17=NormalLoseState,AJ16>AJ17),TRUE)","v":true},null,null,null,null,null,null,null,null,null,null,null,null,null,null,null,null,null,null,null,null,null,null,null,null,null,null,null,null,null,null,null,null,null,null,null,null,null,null,null,null,15,{"$f":"CB15","v":22},{"$f":"CC15+8","v":24},"$X$22",{"$f":"CONCATENATE($B$2)","v":"2"},15,"","09:00:00",0,"","00:00:00","00:00:00","","",0,0,0,"Igor BAJSIČ",799,0,0,0,false]
["Q",{"$f":"VLOOKUP(D17,BN$4:BP$11,2,)","v":"Igor BAJSIČ"},{"$f":"VLOOKUP(D17,BN$4:BP$11,3,)","v":""},2,null,null,{"$f":"CELL(\"address\",OFFSET($A$5,L14,0))","v":"$A$6"},null,{"$f":"IF(G18=\"*\",IF(AND(OFFSET(INDIRECT(G17),0,0)>0,NOT(ISNA(OFFSET(INDIRECT(G17),0,1)))),OFFSET(INDIRECT(G17),0,1),UnsetMatchCompetitorText),IF(OFFSET(INDIRECT(G17),2,5)>0,IF(COUNTIF(INDIRECT(G18),(OFFSET(INDIRECT(G17),0,5)))>0,OFFSET(INDIRECT(G17),0,1),IF(COUNTIF(INDIRECT(G18),(OFFSET(INDIRECT(G17),1,5)))>0,OFFSET(INDIRECT(G17),1,1),BlankMatchCompetitorText)),AwaitingMatchCompetitorText))","v":"Janez LAVRIČ"},null,null,5,"W",{"$f":"IF(M17=NormalWinState,AND(M16=NormalLoseState,L17>L16),TRUE)","v":true},{"$f":"CELL(\"address\",OFFSET($A$5,T14,0))","v":"$A$12"},null,{"$f":"IF(O18=\"*\",IF(AND(OFFSET(INDIRECT(O17),0,0)>0,NOT(ISNA(OFFSET(INDIRECT(O17),0,1)))),OFFSET(INDIRECT(O17),0,1),UnsetMatchCompetitorText),IF(OFFSET(INDIRECT(O17),2,5)>0,IF(COUNTIF(INDIRECT(O18),(OFFSET(INDIRECT(O17),0,5)))>0,OFFSET(INDIRECT(O17),0,1),IF(COUNTIF(INDIRECT(O18),(OFFSET(INDIRECT(O17),1,5)))>0,OFFSET(INDIRECT(O17),1,1),BlankMatchCompetitorText)),AwaitingMatchCompetitorText))","v":""},null,null,null,null,{"$f":"IF(U17=NormalWinState,AND(U16=NormalLoseState,T17>T16),TRUE)","v":true},{"$f":"CELL(\"address\",OFFSET($A$5,AB14,0))","v":"$A$11"},null,{"$f":"IF(W18=\"*\",IF(AND(OFFSET(INDIRECT(W17),0,0)>0,NOT(ISNA(OFFSET(INDIRECT(W17),0,1)))),OFFSET(INDIRECT(W17),0,1),UnsetMatchCompetitorText),IF(OFFSET(INDIRECT(W17),2,5)>0,IF(COUNTIF(INDIRECT(W18),(OFFSET(INDIRECT(W17),0,5)))>0,OFFSET(INDIRECT(W17),0,1),IF(COUNTIF(INDIRECT(W18),(OFFSET(INDIRECT(W17),1,5)))>0,OFFSET(INDIRECT(W17),1,1),BlankMatchCompetitorText)),AwaitingMatchCompetitorText))","v":"Matej BRAJKOVIČ"},null,null,5,"W",{"$f":"IF(AC17=NormalWinState,AND(AC16=NormalLoseState,AB17>AB16),TRUE)","v":true},{"$f":"CELL(\"address\",OFFSET($A$5,AJ14,0))","v":"$A$13"},null,{"$f":"IF(AE18=\"*\",IF(AND(OFFSET(INDIRECT(AE17),0,0)>0,NOT(ISNA(OFFSET(INDIRECT(AE17),0,1)))),OFFSET(INDIRECT(AE17),0,1),UnsetMatchCompetitorText),IF(OFFSET(INDIRECT(AE17),2,5)>0,IF(COUNTIF(INDIRECT(AE18),(OFFSET(INDIRECT(AE17),0,5)))>0,OFFSET(INDIRECT(AE17),0,1),IF(COUNTIF(INDIRECT(AE18),(OFFSET(INDIRECT(AE17),1,5)))>0,OFFSET(INDIRECT(AE17),1,1),BlankMatchCompetitorText)),AwaitingMatchCompetitorText))","v":"Jan HVALEC"},null,null,null,null,{"$f":"IF(AK17=NormalWinState,AND(AK16=NormalLoseState,AJ17>AJ16),TRUE)","v":true},null,null,null,null,null,null,null,null,null,null,null,null,null,null,null,null,null,null,null,null,null,null,null,null,null,null,null,null,null,null,null,null,null,null,null,null,null,null,null,null,16,{"$f":"CB16","v":22},{"$f":"CC16+8","v":32},"$AF$22",{"$f":"CONCATENATE($B$2)","v":"2"},16,"3","09:00:00",5,"","12:51:00","13:26:00","00:35:00","Jan HVALEC",919,1,"L","Matej BRAJKOVIČ",440,5,"W","F",true]
[{"$f":"A19-TournamentGroupCount","v":17},{"$error":"#N/A"},{"$error":"#N/A"},3,null,null,"*",4,"10:46:00","11:55:00",{"$f":"IF(ISBLANK(I18),\"\",IF(ISBLANK(J18),CurrentTime-I18,J18-I18))","v":"01:09:00"},"F",{"$f":"IF(AND(COUNTIF(FinishedMatchStates,L18),NOT(ISNA(VLOOKUP(M16,MatchCompetitorStateCodes,1,FALSE))),NOT(ISNA(VLOOKUP(M17,MatchCompetitorStateCodes,1,FALSE))),COUNTIF(WinStates,M16)+COUNTIF(WinStates,M17)<=1,COUNTIF(LoseStates,M16)+COUNTIF(LoseStates,M17)<=1,IF(M16=NormalWinState,AND(M17=NormalLoseState,L16>L17),TRUE),IF(M17=NormalWinState,AND(M16=NormalLoseState,L17>L16),TRUE),NOT(ISBLANK(L15)),NOT(ISBLANK(I15)),NOT(ISBLANK(I18)),NOT(ISBLANK(J18)),H15>0),1,IF(COUNTIF(FinishedMatchStates,L18)>0,-1,0))","v":1},null,"*",null,null,null,{"$f":"IF(ISBLANK(Q18),\"\",IF(ISBLANK(R18),CurrentTime-Q18,R18-Q18))","v":""},null,{"$f":"IF(AND(COUNTIF(FinishedMatchStates,T18),NOT(ISNA(VLOOKUP(U16,MatchCompetitorStateCodes,1,FALSE))),NOT(ISNA(VLOOKUP(U17,MatchCompetitorStateCodes,1,FALSE))),COUNTIF(WinStates,U16)+COUNTIF(WinStates,U17)<=1,COUNTIF(LoseStates,U16)+COUNTIF(LoseStates,U17)<=1,IF(U16=NormalWinState,AND(U17=NormalLoseState,T16>T17),TRUE),IF(U17=NormalWinState,AND(U16=NormalLoseState,T17>T16),TRUE),NOT(ISBLANK(T15)),NOT(ISBLANK(Q15)),NOT(ISBLANK(Q18)),NOT(ISBLANK(R18)),P15>0),1,IF(COUNTIF(FinishedMatchStates,T18)>0,-1,0))","v":0},null,"*",3,"10:29:00","11:29:00",{"$f":"IF(ISBLANK(Y18),\"\",IF(ISBLANK(Z18),CurrentTime-Y18,Z18-Y18))","v":"01:00:00"},"F",{"$f":"IF(AND(COUNTIF(FinishedMatchStates,AB18),NOT(ISNA(VLOOKUP(AC16,MatchCompetitorStateCodes,1,FALSE))),NOT(ISNA(VLOOKUP(AC17,MatchCompetitorStateCodes,1,FALSE))),COUNTIF(WinStates,AC16)+COUNTIF(WinStates,AC17)<=1,COUNTIF(LoseStates,AC16)+COUNTIF(LoseStates,AC17)<=1,IF(AC16=NormalWinState,AND(AC17=NormalLoseState,AB16>AB17),TRUE),IF(AC17=NormalWinState,AND(AC16=NormalLoseState,AB17>AB16),TRUE),NOT(ISBLANK(AB15)),NOT(ISBLANK(Y15)),NOT(ISBLANK(Y18)),NOT(ISBLANK(Z18)),X15>0),1,IF(COUNTIF(FinishedMatchStates,AB18)>0,-1,0))","v":1},null,"*",null,null,null,{"$f":"IF(ISBLANK(AG18),\"\",IF(ISBLANK(AH18),CurrentTime-AG18,AH18-AG18))","v":""},null,{"$f":"IF(AND(COUNTIF(FinishedMatchStates,AJ18),NOT(ISNA(VLOOKUP(AK16,MatchCompetitorStateCodes,1,FALSE))),NOT(ISNA(VLOOKUP(AK17,MatchCompetitorStateCodes,1,FALSE))),COUNTIF(WinStates,AK16)+COUNTIF(WinStates,AK17)<=1,COUNTIF(LoseStates,AK16)+COUNTIF(LoseStates,AK17)<=1,IF(AK16=NormalWinState,AND(AK17=NormalLoseState,AJ16>AJ17),TRUE),IF(AK17=NormalWinState,AND(AK16=NormalLoseState,AJ17>AJ16),TRUE),NOT(ISBLANK(AJ15)),NOT(ISBLANK(AG15)),NOT(ISBLANK(AG18)),NOT(ISBLANK(AH18)),AF15>0),1,IF(COUNTIF(FinishedMatchStates,AJ18)>0,-1,0))","v":0},null,null,null,null,null,null,null,null,null,null,null,null,null,null,null,null,null,null,null,null,null,null,null,null,null,null,null,null,null,null,null,null,null,null,null,null,null,null,null,null,null,17,{"$f":"CB14+6","v":28},{"$f":"CC14","v":8},"$H$28","2",17,"5","09:00:00",5,"","12:48:00","13:30:00","00:42:00","Igor BAJSIČ",799,5,"W","Janez LAVRIČ",914,2,"L","F",true]
[{"$f":"A20-TournamentGroupCount","v":21},{"$error":"#N/A"},{"$error":"#N/A"},4,null,null,null,null,null,null,null,null,null,null,null,null,null,null,null,null,null,null,null,null,null,null,null,null,null,null,null,null,null,null,null,null,null,null,null,null,null,null,null,null,null,null,null,null,null,null,null,null,null,null,null,null,null,null,null,null,null,null,null,null,null,null,null,null,null,null,null,null,null,null,null,null,null,null,18,{"$f":"CB18","v":28},{"$f":"CC18+8","v":16},"$P$28",{"$f":"CONCATENATE($B$2)","v":"2"},18,"","09:00:00",0,"","00:00:00","00:00:00","","Kristijan NIKL",595,0,0,"",0,0,0,0,false]
[{"$f":"A21-TournamentGroupCount","v":25},{"$error":"#N/A"},{"$error":"#N/A"},5,null,null,{"$f":"G14","v":1},{"$f":"H14+1","v":4},{"$f":"I14","v":1},{"$f":"((H20-1)*$B$3)+I20","v":13},1,4,null,null,{"$f":"G20","v":1},{"$f":"H20","v":4},{"$f":"I20+1","v":2},{"$f":"((P20-1)*$B$3)+Q20","v":14},2,3,null,null,{"$f":"O20","v":1},{"$f":"P20","v":4},{"$f":"Q20+1","v":3},{"$f":"((X20-1)*$B$3)+Y20","v":15},7,5,null,null,{"$f":"W20","v":1},{"$f":"X20","v":4},{"$f":"Y20+1","v":4},{"$f":"((AF20-1)*$B$3)+AG20","v":16},8,6,null,null,null,null,null,null,null,null,null,null,null,null,null,null,null,null,null,null,null,null,null,null,null,null,null,null,null,null,null,null,null,null,null,null,null,null,null,null,null,null,null,null,19,{"$f":"CB19","v":28},{"$f":"CC19+8","v":24},"$X$28",{"$f":"CONCATENATE($B$2)","v":"2"},19,"","09:00:00",0,"","00:00:00","00:00:00","","Matej BRAJKOVIČ",440,0,0,"",0,0,0,0,false]
[{"$f":"A22-TournamentGroupCount","v":29},{"$error":"#N/A"},{"$error":"#N/A"},6,null,null,{"$f":"CELL(\"address\",OFFSET($A$5,K20,0))","v":"$A$6"},{"$f":"IF(AND(NOT(ISBLANK(I22)),I22<>UnsetMatchCompetitorText,I22<>AwaitingMatchCompetitorText,NOT(ISBLANK(I23)),I23<>UnsetMatchCompetitorText,I23<>AwaitingMatchCompetitorText),1,IF(AND(I22<>AwaitingMatchCompetitorText,I23<>AwaitingMatchCompetitorText),-1,0))","v":1},"09:00:00",null,null,5,null,null,{"$f":"CELL(\"address\",OFFSET($A$5,S20,0))","v":"$A$7"},{"$f":"IF(AND(NOT(ISBLANK(Q22)),Q22<>UnsetMatchCompetitorText,Q22<>AwaitingMatchCompetitorText,NOT(ISBLANK(Q23)),Q23<>UnsetMatchCompetitorText,Q23<>AwaitingMatchCompetitorText),1,IF(AND(Q22<>AwaitingMatchCompetitorText,Q23<>AwaitingMatchCompetitorText),-1,0))","v":1},"09:00:00",null,null,null,null,null,{"$f":"CELL(\"address\",OFFSET($A$5,AA20,0))","v":"$A$12"},{"$f":"IF(AND(NOT(ISBLANK(Y22)),Y22<>UnsetMatchCompetitorText,Y22<>AwaitingMatchCompetitorText,NOT(ISBLANK(Y23)),Y23<>UnsetMatchCompetitorText,Y23<>AwaitingMatchCompetitorText),1,IF(AND(Y22<>AwaitingMatchCompetitorText,Y23<>AwaitingMatchCompetitorText),-1,0))","v":1},"09:00:00",null,null,null,null,null,{"$f":"CELL(\"address\",OFFSET($A$5,AI20,0))","v":"$A$13"},{"$f":"IF(AND(NOT(ISBLANK(AG22)),AG22<>UnsetMatchCompetitorText,AG22<>AwaitingMatchCompetitorText,NOT(ISBLANK(AG23)),AG23<>UnsetMatchCompetitorText,AG23<>AwaitingMatchCompetitorText),1,IF(AND(AG22<>AwaitingMatchCompetitorText,AG23<>AwaitingMatchCompetitorText),-1,0))","v":1},"09:00:00",null,null,5,null,null,null,null,null,null,null,null,null,null,null,null,null,null,null,null,null,null,null,null,null,null,null,null,null,null,null,null,null,null,null,null,null,null,null,null,null,null,null,null,null,null,20,{"$f":"CB20","v":28},{"$f":"CC20+8","v":32},"$AF$28",{"$f":"CONCATENATE($B$2)","v":"2"},20,"4","09:00:00",5,"","10:10:00","10:46:00","00:36:00","Beno MESSNER",538,5,"W","Jan HVALEC",919,0,"L","F",true]
[{"$f":"A23-TournamentGroupCount","v":33},{"$error":"#N/A"},{"$error":"#N/A"},7,null,null,"*",{"$f":"J20","v":13},{"$f":"IF(G22=\"*\",IF(AND(OFFSET(INDIRECT(G21),0,0)>0,NOT(ISNA(OFFSET(INDIRECT(G21),0,1)))),OFFSET(INDIRECT(G21),0,1),UnsetMatchCompetitorText),IF(OFFSET(INDIRECT(G21),2,5)>0,IF(COUNTIF(INDIRECT(G22),(OFFSET(INDIRECT(G21),0,5)))>0,OFFSET(INDIRECT(G21),0,1),IF(COUNTIF(INDIRECT(G22),(OFFSET(INDIRECT(G21),1,5)))>0,OFFSET(INDIRECT(G21),1,1),BlankMatchCompetitorText)),AwaitingMatchCompetitorText))","v":"Janez LAVRIČ"},null,null,4,"L",{"$f":"IF(M22=NormalWinState,AND(M23=NormalLoseState,L22>L23),TRUE)","v":true},"*",{"$f":"R20","v":14},{"$f":"IF(O22=\"*\",IF(AND(OFFSET(INDIRECT(O21),0,0)>0,NOT(ISNA(OFFSET(INDIRECT(O21),0,1)))),OFFSET(INDIRECT(O21),0,1),UnsetMatchCompetitorText),IF(OFFSET(INDIRECT(O21),2,5)>0,IF(COUNTIF(INDIRECT(O22),(OFFSET(INDIRECT(O21),0,5)))>0,OFFSET(INDIRECT(O21),0,1),IF(COUNTIF(INDIRECT(O22),(OFFSET(INDIRECT(O21),1,5)))>0,OFFSET(INDIRECT(O21),1,1),BlankMatchCompetitorText)),AwaitingMatchCompetitorText))","v":""},null,null,null,null,{"$f":"IF(U22=NormalWinState,AND(U23=NormalLoseState,T22>T23),TRUE)","v":true},"*",{"$f":"Z20","v":15},{"$f":"IF(W22=\"*\",IF(AND(OFFSET(INDIRECT(W21),0,0)>0,NOT(ISNA(OFFSET(INDIRECT(W21),0,1)))),OFFSET(INDIRECT(W21),0,1),UnsetMatchCompetitorText),IF(OFFSET(INDIRECT(W21),2,5)>0,IF(COUNTIF(INDIRECT(W22),(OFFSET(INDIRECT(W21),0,5)))>0,OFFSET(INDIRECT(W21),0,1),IF(COUNTIF(INDIRECT(W22),(OFFSET(INDIRECT(W21),1,5)))>0,OFFSET(INDIRECT(W21),1,1),BlankMatchCompetitorText)),AwaitingMatchCompetitorText))","v":""},null,null,null,null,{"$f":"IF(AC22=NormalWinState,AND(AC23=NormalLoseState,AB22>AB23),TRUE)","v":true},"*",{"$f":"AH20","v":16},{"$f":"IF(AE22=\"*\",IF(AND(OFFSET(INDIRECT(AE21),0,0)>0,NOT(ISNA(OFFSET(INDIRECT(AE21),0,1)))),OFFSET(INDIRECT(AE21),0,1),UnsetMatchCompetitorText),IF(OFFSET(INDIRECT(AE21),2,5)>0,IF(COUNTIF(INDIRECT(AE22),(OFFSET(INDIRECT(AE21),0,5)))>0,OFFSET(INDIRECT(AE21),0,1),IF(COUNTIF(INDIRECT(AE22),(OFFSET(INDIRECT(AE21),1,5)))>0,OFFSET(INDIRECT(AE21),1,1),BlankMatchCompetitorText)),AwaitingMatchCompetitorText))","v":"Jan HVALEC"},null,null,1,"L",{"$f":"IF(AK22=NormalWinState,AND(AK23=NormalLoseState,AJ22>AJ23),TRUE)","v":true},null,null,null,null,null,null,null,null,null,null,null,null,null,null,null,null,null,null,null,null,null,null,null,null,null,null,null,null,null,null,null,null,null,null,null,null,null,null,null,null,21,{"$f":"CB18+6","v":34},{"$f":"CC18","v":8},"$H$34","2",21,"5","09:00:00",5,"","11:59:00","12:48:00","00:49:00","Janez LAVRIČ",914,1,"L","Matej BRAJKOVIČ",440,5,"W","F",true]
[{"$f":"TournamentSize-TournamentGroupCount+1","v":37},{"$error":"#N/A"},{"$error":"#N/A"},8,null,null,{"$f":"CELL(\"address\",OFFSET($A$5,L20,0))","v":"$A$9"},null,{"$f":"IF(G24=\"*\",IF(AND(OFFSET(INDIRECT(G23),0,0)>0,NOT(ISNA(OFFSET(INDIRECT(G23),0,1)))),OFFSET(INDIRECT(G23),0,1),UnsetMatchCompetitorText),IF(OFFSET(INDIRECT(G23),2,5)>0,IF(COUNTIF(INDIRECT(G24),(OFFSET(INDIRECT(G23),0,5)))>0,OFFSET(INDIRECT(G23),0,1),IF(COUNTIF(INDIRECT(G24),(OFFSET(INDIRECT(G23),1,5)))>0,OFFSET(INDIRECT(G23),1,1),BlankMatchCompetitorText)),AwaitingMatchCompetitorText))","v":"Kristijan NIKL"},null,null,5,"W",{"$f":"IF(M23=NormalWinState,AND(M22=NormalLoseState,L23>L22),TRUE)","v":true},{"$f":"CELL(\"address\",OFFSET($A$5,T20,0))","v":"$A$8"},null,{"$f":"IF(O24=\"*\",IF(AND(OFFSET(INDIRECT(O23),0,0)>0,NOT(ISNA(OFFSET(INDIRECT(O23),0,1)))),OFFSET(INDIRECT(O23),0,1),UnsetMatchCompetitorText),IF(OFFSET(INDIRECT(O23),2,5)>0,IF(COUNTIF(INDIRECT(O24),(OFFSET(INDIRECT(O23),0,5)))>0,OFFSET(INDIRECT(O23),0,1),IF(COUNTIF(INDIRECT(O24),(OFFSET(INDIRECT(O23),1,5)))>0,OFFSET(INDIRECT(O23),1,1),BlankMatchCompetitorText)),AwaitingMatchCompetitorText))","v":"Beno MESSNER"},null,null,null,null,{"$f":"IF(U23=NormalWinState,AND(U22=NormalLoseState,T23>T22),TRUE)","v":true},{"$f":"CELL(\"address\",OFFSET($A$5,AB20,0))","v":"$A$10"},null,{"$f":"IF(W24=\"*\",IF(AND(OFFSET(INDIRECT(W23),0,0)>0,NOT(ISNA(OFFSET(INDIRECT(W23),0,1)))),OFFSET(INDIRECT(W23),0,1),UnsetMatchCompetitorText),IF(OFFSET(INDIRECT(W23),2,5)>0,IF(COUNTIF(INDIRECT(W24),(OFFSET(INDIRECT(W23),0,5)))>0,OFFSET(INDIRECT(W23),0,1),IF(COUNTIF(INDIRECT(W24),(OFFSET(INDIRECT(W23),1,5)))>0,OFFSET(INDIRECT(W23),1,1),BlankMatchCompetitorText)),AwaitingMatchCompetitorText))","v":"Igor BAJSIČ"},null,null,null,null,{"$f":"IF(AC23=NormalWinState,AND(AC22=NormalLoseState,AB23>AB22),TRUE)","v":true},{"$f":"CELL(\"address\",OFFSET($A$5,AJ20,0))","v":"$A$11"},null,{"$f":"IF(AE24=\"*\",IF(AND(OFFSET(INDIRECT(AE23),0,0)>0,NOT(ISNA(OFFSET(INDIRECT(AE23),0,1)))),OFFSET(INDIRECT(AE23),0,1),UnsetMatchCompetitorText),IF(OFFSET(INDIRECT(AE23),2,5)>0,IF(COUNTIF(INDIRECT(AE24),(OFFSET(INDIRECT(AE23),0,5)))>0,OFFSET(INDIRECT(AE23),0,1),IF(COUNTIF(INDIRECT(AE24),(OFFSET(INDIRECT(AE23),1,5)))>0,OFFSET(INDIRECT(AE23),1,1),BlankMatchCompetitorText)),AwaitingMatchCompetitorText))","v":"Matej BRAJKOVIČ"},null,null,5,"W",{"$f":"IF(AK23=NormalWinState,AND(AK22=NormalLoseState,AJ23>AJ22),TRUE)","v":true},null,null,null,null,null,null,null,null,null,null,null,null,null,null,null,null,null,null,null,null,null,null,null,null,null,null,null,null,null,null,null,null,null,null,null,null,null,null,null,null,22,{"$f":"CB22","v":34},{"$f":"CC22+8","v":16},"$P$34",{"$f":"CONCATENATE($B$2)","v":"2"},22,"","09:00:00",0,"","00:00:00","00:00:00","","",0,0,0,"Igor BAJSIČ",799,0,0,0,false]
[null,null,null,null,null,null,"*",5,"13:31:00","14:30:00",{"$f":"IF(ISBLANK(I24),\"\",IF(ISBLANK(J24),CurrentTime-I24,J24-I24))","v":"00:59:00"},"F",{"$f":"IF(AND(COUNTIF(FinishedMatchStates,L24),NOT(ISNA(VLOOKUP(M22,MatchCompetitorStateCodes,1,FALSE))),NOT(ISNA(VLOOKUP(M23,MatchCompetitorStateCodes,1,FALSE))),COUNTIF(WinStates,M22)+COUNTIF(WinStates,M23)<=1,COUNTIF(LoseStates,M22)+COUNTIF(LoseStates,M23)<=1,IF(M22=NormalWinState,AND(M23=NormalLoseState,L22>L23),TRUE),IF(M23=NormalWinState,AND(M22=NormalLoseState,L23>L22),TRUE),NOT(ISBLANK(L21)),NOT(ISBLANK(I21)),NOT(ISBLANK(I24)),NOT(ISBLANK(J24)),H21>0),1,IF(COUNTIF(FinishedMatchStates,L24)>0,-1,0))","v":1},null,"*",null,null,null,{"$f":"IF(ISBLANK(Q24),\"\",IF(ISBLANK(R24),CurrentTime-Q24,R24-Q24))","v":""},null,{"$f":"IF(AND(COUNTIF(FinishedMatchStates,T24),NOT(ISNA(VLOOKUP(U22,MatchCompetitorStateCodes,1,FALSE))),NOT(ISNA(VLOOKUP(U23,MatchCompetitorStateCodes,1,FALSE))),COUNTIF(WinStates,U22)+COUNTIF(WinStates,U23)<=1,COUNTIF(LoseStates,U22)+COUNTIF(LoseStates,U23)<=1,IF(U22=NormalWinState,AND(U23=NormalLoseState,T22>T23),TRUE),IF(U23=NormalWinState,AND(U22=NormalLoseState,T23>T22),TRUE),NOT(ISBLANK(T21)),NOT(ISBLANK(Q21)),NOT(ISBLANK(Q24)),NOT(ISBLANK(R24)),P21>0),1,IF(COUNTIF(FinishedMatchStates,T24)>0,-1,0))","v":0},null,"*",null,null,null,{"$f":"IF(ISBLANK(Y24),\"\",IF(ISBLANK(Z24),CurrentTime-Y24,Z24-Y24))","v":""},null,{"$f":"IF(AND(COUNTIF(FinishedMatchStates,AB24),NOT(ISNA(VLOOKUP(AC22,MatchCompetitorStateCodes,1,FALSE))),NOT(ISNA(VLOOKUP(AC23,MatchCompetitorStateCodes,1,FALSE))),COUNTIF(WinStates,AC22)+COUNTIF(WinStates,AC23)<=1,COUNTIF(LoseStates,AC22)+COUNTIF(LoseStates,AC23)<=1,IF(AC22=NormalWinState,AND(AC23=NormalLoseState,AB22>AB23),TRUE),IF(AC23=NormalWinState,AND(AC22=NormalLoseState,AB23>AB22),TRUE),NOT(ISBLANK(AB21)),NOT(ISBLANK(Y21)),NOT(ISBLANK(Y24)),NOT(ISBLANK(Z24)),X21>0),1,IF(COUNTIF(FinishedMatchStates,AB24)>0,-1,0))","v":0},null,"*",3,"12:51:00","13:26:00",{"$f":"IF(ISBLANK(AG24),\"\",IF(ISBLANK(AH24),CurrentTime-AG24,AH24-AG24))","v":"00:35:00"},"F",{"$f":"IF(AND(COUNTIF(FinishedMatchStates,AJ24),NOT(ISNA(VLOOKUP(AK22,MatchCompetitorStateCodes,1,FALSE))),NOT(ISNA(VLOOKUP(AK23,MatchCompetitorStateCodes,1,FALSE))),COUNTIF(WinStates,AK22)+COUNTIF(WinStates,AK23)<=1,COUNTIF(LoseStates,AK22)+COUNTIF(LoseStates,AK23)<=1,IF(AK22=NormalWinState,AND(AK23=NormalLoseState,AJ22>AJ23),TRUE),IF(AK23=NormalWinState,AND(AK22=NormalLoseState,AJ23>AJ22),TRUE),NOT(ISBLANK(AJ21)),NOT(ISBLANK(AG21)),NOT(ISBLANK(AG24)),NOT(ISBLANK(AH24)),AF21>0),1,IF(COUNTIF(FinishedMatchStates,AJ24)>0,-1,0))","v":1},null,null,null,null,null,null,null,null,null,null,null,null,null,null,null,null,null,null,null,null,null,null,null,null,null,null,null,null,null,null,null,null,null,null,null,null,null,null,null,null,null,23,{"$f":"CB23","v":34},{"$f":"CC23+8","v":24},"$X$34",{"$f":"CONCATENATE($B$2)","v":"2"},23,"4","09:00:00",5,"","11:59:00","12:58:00","00:59:00","Beno MESSNER",538,3,"L","Kristijan NIKL",595,5,"W","F",true]
[null,null,null,null,null,null,null,null,null,null,null,null,null,null,null,null,null,null,null,null,null,null,null,null,null,null,null,null,null,null,null,null,null,null,null,null,null,null,null,null,null,null,null,null,null,null,null,null,null,null,null,null,null,null,null,null,null,null,null,null,null,null,null,null,null,null,null,null,null,null,null,null,null,null,null,null,null,null,24,{"$f":"CB24","v":34},{"$f":"CC24+8","v":32},"$AF$34",{"$f":"CONCATENATE($B$2)","v":"2"},24,"","09:00:00",0,"","00:00:00","00:00:00","","Jan HVALEC",919,0,0,"",0,0,0,0,false]
[null,null,null,null,null,null,{"$f":"G20","v":1},{"$f":"H20+1","v":5},{"$f":"I20","v":1},{"$f":"((H26-1)*$B$3)+I26","v":17},5,1,null,null,{"$f":"G26","v":1},{"$f":"H26","v":5},{"$f":"I26+1","v":2},{"$f":"((P26-1)*$B$3)+Q26","v":18},4,2,null,null,{"$f":"O26","v":1},{"$f":"P26","v":5},{"$f":"Q26+1","v":3},{"$f":"((X26-1)*$B$3)+Y26","v":19},6,7,null,null,{"$f":"W26","v":1},{"$f":"X26","v":5},{"$f":"Y26+1","v":4},{"$f":"((AF26-1)*$B$3)+AG26","v":20},3,8,null,null,null,null,null,null,null,null,null,null,null,null,null,null,null,null,null,null,null,null,null,null,null,null,null,null,null,null,null,null,null,null,null,null,null,null,null,null,null,null,null,null,25,{"$f":"CB22+6","v":40},{"$f":"CC22","v":8},"$H$40","2",25,"","09:00:00",0,"","00:00:00","00:00:00","","",0,0,0,"Janez LAVRIČ",914,0,0,0,false]
[null,null,null,null,null,null,{"$f":"CELL(\"address\",OFFSET($A$5,K26,0))","v":"$A$10"},{"$f":"IF(AND(NOT(ISBLANK(I28)),I28<>UnsetMatchCompetitorText,I28<>AwaitingMatchCompetitorText,NOT(ISBLANK(I29)),I29<>UnsetMatchCompetitorText,I29<>AwaitingMatchCompetitorText),1,IF(AND(I28<>AwaitingMatchCompetitorText,I29<>AwaitingMatchCompetitorText),-1,0))","v":1},"09:00:00",null,null,5,null,null,{"$f":"CELL(\"address\",OFFSET($A$5,S26,0))","v":"$A$9"},{"$f":"IF(AND(NOT(ISBLANK(Q28)),Q28<>UnsetMatchCompetitorText,Q28<>AwaitingMatchCompetitorText,NOT(ISBLANK(Q29)),Q29<>UnsetMatchCompetitorText,Q29<>AwaitingMatchCompetitorText),1,IF(AND(Q28<>AwaitingMatchCompetitorText,Q29<>AwaitingMatchCompetitorText),-1,0))","v":1},"09:00:00",null,null,null,null,null,{"$f":"CELL(\"address\",OFFSET($A$5,AA26,0))","v":"$A$11"},{"$f":"IF(AND(NOT(ISBLANK(Y28)),Y28<>UnsetMatchCompetitorText,Y28<>AwaitingMatchCompetitorText,NOT(ISBLANK(Y29)),Y29<>UnsetMatchCompetitorText,Y29<>AwaitingMatchCompetitorText),1,IF(AND(Y28<>AwaitingMatchCompetitorText,Y29<>AwaitingMatchCompetitorText),-1,0))","v":1},"09:00:00",null,null,null,null,null,{"$f":"CELL(\"address\",OFFSET($A$5,AI26,0))","v":"$A$8"},{"$f":"IF(AND(NOT(ISBLANK(AG28)),AG28<>UnsetMatchCompetitorText,AG28<>AwaitingMatchCompetitorText,NOT(ISBLANK(AG29)),AG29<>UnsetMatchCompetitorText,AG29<>AwaitingMatchCompetitorText),1,IF(AND(AG28<>AwaitingMatchCompetitorText,AG29<>AwaitingMatchCompetitorText),-1,0))","v":1},"09:00:00",null,null,5,null,null,null,null,null,null,null,null,null,null,null,null,null,null,null,null,null,null,null,null,null,null,null,null,null,null,null,null,null,null,null,null,null,null,null,null,null,null,null,null,null,null,26,{"$f":"CB26","v":40},{"$f":"CC26+8","v":16},"$P$40",{"$f":"CONCATENATE($B$2)","v":"2"},26,"","09:00:00",0,"","00:00:00","00:00:00","","Matej BRAJKOVIČ",440,0,0,"",0,0,0,0,false]
[null,null,null,null,null,null,"*",{"$f":"J26","v":17},{"$f":"IF(G28=\"*\",IF(AND(OFFSET(INDIRECT(G27),0,0)>0,NOT(ISNA(OFFSET(INDIRECT(G27),0,1)))),OFFSET(INDIRECT(G27),0,1),UnsetMatchCompetitorText),IF(OFFSET(INDIRECT(G27),2,5)>0,IF(COUNTIF(INDIRECT(G28),(OFFSET(INDIRECT(G27),0,5)))>0,OFFSET(INDIRECT(G27),0,1),IF(COUNTIF(INDIRECT(G28),(OFFSET(INDIRECT(G27),1,5)))>0,OFFSET(INDIRECT(G27),1,1),BlankMatchCompetitorText)),AwaitingMatchCompetitorText))","v":"Igor BAJSIČ"},null,null,5,"W",{"$f":"IF(M28=NormalWinState,AND(M29=NormalLoseState,L28>L29),TRUE)","v":true},"*",{"$f":"R26","v":18},{"$f":"IF(O28=\"*\",IF(AND(OFFSET(INDIRECT(O27),0,0)>0,NOT(ISNA(OFFSET(INDIRECT(O27),0,1)))),OFFSET(INDIRECT(O27),0,1),UnsetMatchCompetitorText),IF(OFFSET(INDIRECT(O27),2,5)>0,IF(COUNTIF(INDIRECT(O28),(OFFSET(INDIRECT(O27),0,5)))>0,OFFSET(INDIRECT(O27),0,1),IF(COUNTIF(INDIRECT(O28),(OFFSET(INDIRECT(O27),1,5)))>0,OFFSET(INDIRECT(O27),1,1),BlankMatchCompetitorText)),AwaitingMatchCompetitorText))","v":"Kristijan NIKL"},null,null,null,null,{"$f":"IF(U28=NormalWinState,AND(U29=NormalLoseState,T28>T29),TRUE)","v":true},"*",{"$f":"Z26","v":19},{"$f":"IF(W28=\"*\",IF(AND(OFFSET(INDIRECT(W27),0,0)>0,NOT(ISNA(OFFSET(INDIRECT(W27),0,1)))),OFFSET(INDIRECT(W27),0,1),UnsetMatchCompetitorText),IF(OFFSET(INDIRECT(W27),2,5)>0,IF(COUNTIF(INDIRECT(W28),(OFFSET(INDIRECT(W27),0,5)))>0,OFFSET(INDIRECT(W27),0,1),IF(COUNTIF(INDIRECT(W28),(OFFSET(INDIRECT(W27),1,5)))>0,OFFSET(INDIRECT(W27),1,1),BlankMatchCompetitorText)),AwaitingMatchCompetitorText))","v":"Matej BRAJKOVIČ"},null,null,null,null,{"$f":"IF(AC28=NormalWinState,AND(AC29=NormalLoseState,AB28>AB29),TRUE)","v":true},"*",{"$f":"AH26","v":20},{"$f":"IF(AE28=\"*\",IF(AND(OFFSET(INDIRECT(AE27),0,0)>0,NOT(ISNA(OFFSET(INDIRECT(AE27),0,1)))),OFFSET(INDIRECT(AE27),0,1),UnsetMatchCompetitorText),IF(OFFSET(INDIRECT(AE27),2,5)>0,IF(COUNTIF(INDIRECT(AE28),(OFFSET(INDIRECT(AE27),0,5)))>0,OFFSET(INDIRECT(AE27),0,1),IF(COUNTIF(INDIRECT(AE28),(OFFSET(INDIRECT(AE27),1,5)))>0,OFFSET(INDIRECT(AE27),1,1),BlankMatchCompetitorText)),AwaitingMatchCompetitorText))","v":"Beno MESSNER"},null,null,5,"W",{"$f":"IF(AK28=NormalWinState,AND(AK29=NormalLoseState,AJ28>AJ29),TRUE)","v":true},null,null,null,null,null,null,null,null,null,null,null,null,null,null,null,null,null,null,null,null,null,null,null,null,null,null,null,null,null,null,null,null,null,null,null,null,null,null,null,null,27,{"$f":"CB27","v":40},{"$f":"CC27+8","v":24},"$X$40",{"$f":"CONCATENATE($B$2)","v":"2"},27,"4","09:00:00",5,"","14:30:00","15:34:00","01:04:00","Igor BAJSIČ",799,5,"W","Beno MESSNER",538,4,"L","F",true]
[null,null,null,null,null,null,{"$f":"CELL(\"address\",OFFSET($A$5,L26,0))","v":"$A$6"},null,{"$f":"IF(G30=\"*\",IF(AND(OFFSET(INDIRECT(G29),0,0)>0,NOT(ISNA(OFFSET(INDIRECT(G29),0,1)))),OFFSET(INDIRECT(G29),0,1),UnsetMatchCompetitorText),IF(OFFSET(INDIRECT(G29),2,5)>0,IF(COUNTIF(INDIRECT(G30),(OFFSET(INDIRECT(G29),0,5)))>0,OFFSET(INDIRECT(G29),0,1),IF(COUNTIF(INDIRECT(G30),(OFFSET(INDIRECT(G29),1,5)))>0,OFFSET(INDIRECT(G29),1,1),BlankMatchCompetitorText)),AwaitingMatchCompetitorText))","v":"Janez LAVRIČ"},null,null,2,"L",{"$f":"IF(M29=NormalWinState,AND(M28=NormalLoseState,L29>L28),TRUE)","v":true},{"$f":"CELL(\"address\",OFFSET($A$5,T26,0))","v":"$A$7"},null,{"$f":"IF(O30=\"*\",IF(AND(OFFSET(INDIRECT(O29),0,0)>0,NOT(ISNA(OFFSET(INDIRECT(O29),0,1)))),OFFSET(INDIRECT(O29),0,1),UnsetMatchCompetitorText),IF(OFFSET(INDIRECT(O29),2,5)>0,IF(COUNTIF(INDIRECT(O30),(OFFSET(INDIRECT(O29),0,5)))>0,OFFSET(INDIRECT(O29),0,1),IF(COUNTIF(INDIRECT(O30),(OFFSET(INDIRECT(O29),1,5)))>0,OFFSET(INDIRECT(O29),1,1),BlankMatchCompetitorText)),AwaitingMatchCompetitorText))","v":""},null,null,null,null,{"$f":"IF(U29=NormalWinState,AND(U28=NormalLoseState,T29>T28),TRUE)","v":true},{"$f":"CELL(\"address\",OFFSET($A$5,AB26,0))","v":"$A$12"},null,{"$f":"IF(W30=\"*\",IF(AND(OFFSET(INDIRECT(W29),0,0)>0,NOT(ISNA(OFFSET(INDIRECT(W29),0,1)))),OFFSET(INDIRECT(W29),0,1),UnsetMatchCompetitorText),IF(OFFSET(INDIRECT(W29),2,5)>0,IF(COUNTIF(INDIRECT(W30),(OFFSET(INDIRECT(W29),0,5)))>0,OFFSET(INDIRECT(W29),0,1),IF(COUNTIF(INDIRECT(W30),(OFFSET(INDIRECT(W29),1,5)))>0,OFFSET(INDIRECT(W29),1,1),BlankMatchCompetitorText)),AwaitingMatchCompetitorText))","v":""},null,null,null,null,{"$f":"IF(AC29=NormalWinState,AND(AC28=NormalLoseState,AB29>AB28),TRUE)","v":true},{"$f":"CELL(\"address\",OFFSET($A$5,AJ26,0))","v":"$A$13"},null,{"$f":"IF(AE30=\"*\",IF(AND(OFFSET(INDIRECT(AE29),0,0)>0,NOT(ISNA(OFFSET(INDIRECT(AE29),0,1)))),OFFSET(INDIRECT(AE29),0,1),UnsetMatchCompetitorText),IF(OFFSET(INDIRECT(AE29),2,5)>0,IF(COUNTIF(INDIRECT(AE30),(OFFSET(INDIRECT(AE29),0,5)))>0,OFFSET(INDIRECT(AE29),0,1),IF(COUNTIF(INDIRECT(AE30),(OFFSET(INDIRECT(AE29),1,5)))>0,OFFSET(INDIRECT(AE29),1,1),BlankMatchCompetitorText)),AwaitingMatchCompetitorText))","v":"Jan HVALEC"},null,null,0,"L",{"$f":"IF(AK29=NormalWinState,AND(AK28=NormalLoseState,AJ29>AJ28),TRUE)","v":true},null,null,null,null,null,null,null,null,null,null,null,null,null,null,null,null,null,null,null,null,null,null,null,null,null,null,null,null,null,null,null,null,null,null,null,null,null,null,null,null,28,{"$f":"CB28","v":40},{"$f":"CC28+8","v":32},"$AF$40",{"$f":"CONCATENATE($B$2)","v":"2"},28,"6","09:00:00",5,"","11:05:00","11:35:00","00:30:00","Kristijan NIKL",595,5,"W","Jan HVALEC",919,1,"L","F",true]
[null,null,null,null,null,null,"*",5,"12:48:00","13:30:00",{"$f":"IF(ISBLANK(I30),\"\",IF(ISBLANK(J30),CurrentTime-I30,J30-I30))","v":"00:42:00"},"F",{"$f":"IF(AND(COUNTIF(FinishedMatchStates,L30),NOT(ISNA(VLOOKUP(M28,MatchCompetitorStateCodes,1,FALSE))),NOT(ISNA(VLOOKUP(M29,MatchCompetitorStateCodes,1,FALSE))),COUNTIF(WinStates,M28)+COUNTIF(WinStates,M29)<=1,COUNTIF(LoseStates,M28)+COUNTIF(LoseStates,M29)<=1,IF(M28=NormalWinState,AND(M29=NormalLoseState,L28>L29),TRUE),IF(M29=NormalWinState,AND(M28=NormalLoseState,L29>L28),TRUE),NOT(ISBLANK(L27)),NOT(ISBLANK(I27)),NOT(ISBLANK(I30)),NOT(ISBLANK(J30)),H27>0),1,IF(COUNTIF(FinishedMatchStates,L30)>0,-1,0))","v":1},null,"*",null,null,null,{"$f":"IF(ISBLANK(Q30),\"\",IF(ISBLANK(R30),CurrentTime-Q30,R30-Q30))","v":""},null,{"$f":"IF(AND(COUNTIF(FinishedMatchStates,T30),NOT(ISNA(VLOOKUP(U28,MatchCompetitorStateCodes,1,FALSE))),NOT(ISNA(VLOOKUP(U29,MatchCompetitorStateCodes,1,FALSE))),COUNTIF(WinStates,U28)+COUNTIF(WinStates,U29)<=1,COUNTIF(LoseStates,U28)+COUNTIF(LoseStates,U29)<=1,IF(U28=NormalWinState,AND(U29=NormalLoseState,T28>T29),TRUE),IF(U29=NormalWinState,AND(U28=NormalLoseState,T29>T28),TRUE),NOT(ISBLANK(T27)),NOT(ISBLANK(Q27)),NOT(ISBLANK(Q30)),NOT(ISBLANK(R30)),P27>0),1,IF(COUNTIF(FinishedMatchStates,T30)>0,-1,0))","v":0},null,"*",null,null,null,{"$f":"IF(ISBLANK(Y30),\"\",IF(ISBLANK(Z30),CurrentTime-Y30,Z30-Y30))","v":""},null,{"$f":"IF(AND(COUNTIF(FinishedMatchStates,AB30),NOT(ISNA(VLOOKUP(AC28,MatchCompetitorStateCodes,1,FALSE))),NOT(ISNA(VLOOKUP(AC29,MatchCompetitorStateCodes,1,FALSE))),COUNTIF(WinStates,AC28)+COUNTIF(WinStates,AC29)<=1,COUNTIF(LoseStates,AC28)+COUNTIF(LoseStates,AC29)<=1,IF(AC28=NormalWinState,AND(AC29=NormalLoseState,AB28>AB29),TRUE),IF(AC29=NormalWinState,AND(AC28=NormalLoseState,AB29>AB28),TRUE),NOT(ISBLANK(AB27)),NOT(ISBLANK(Y27)),NOT(ISBLANK(Y30)),NOT(ISBLANK(Z30)),X27>0),1,IF(COUNTIF(FinishedMatchStates,AB30)>0,-1,0))","v":0},null,"*",4,"10:10:00","10:46:00",{"$f":"IF(ISBLANK(AG30),\"\",IF(ISBLANK(AH30),CurrentTime-AG30,AH30-AG30))","v":"00:36:00"},"F",{"$f":"IF(AND(COUNTIF(FinishedMatchStates,AJ30),NOT(ISNA(VLOOKUP(AK28,MatchCompetitorStateCodes,1,FALSE))),NOT(ISNA(VLOOKUP(AK29,MatchCompetitorStateCodes,1,FALSE))),COUNTIF(WinStates,AK28)+COUNTIF(WinStates,AK29)<=1,COUNTIF(LoseStates,AK28)+COUNTIF(LoseStates,AK29)<=1,IF(AK28=NormalWinState,AND(AK29=NormalLoseState,AJ28>AJ29),TRUE),IF(AK29=NormalWinState,AND(AK28=NormalLoseState,AJ29>AJ28),TRUE),NOT(ISBLANK(AJ27)),NOT(ISBLANK(AG27)),NOT(ISBLANK(AG30)),NOT(ISBLANK(AH30)),AF27>0),1,IF(COUNTIF(FinishedMatchStates,AJ30)>0,-1,0))","v":1}]
[]
[null,null,null,null,null,null,{"$f":"G26","v":1},{"$f":"H26+1","v":6},{"$f":"I26","v":1},{"$f":"((H32-1)*$B$3)+I32","v":21},1,6,null,null,{"$f":"G32","v":1},{"$f":"H32","v":6},{"$f":"I32+1","v":2},{"$f":"((P32-1)*$B$3)+Q32","v":22},2,5,null,null,{"$f":"O32","v":1},{"$f":"P32","v":6},{"$f":"Q32+1","v":3},{"$f":"((X32-1)*$B$3)+Y32","v":23},3,4,null,null,{"$f":"W32","v":1},{"$f":"X32","v":6},{"$f":"Y32+1","v":4},{"$f":"((AF32-1)*$B$3)+AG32","v":24},8,7]
[null,null,null,null,null,null,{"$f":"CELL(\"address\",OFFSET($A$5,K32,0))","v":"$A$6"},{"$f":"IF(AND(NOT(ISBLANK(I34)),I34<>UnsetMatchCompetitorText,I34<>AwaitingMatchCompetitorText,NOT(ISBLANK(I35)),I35<>UnsetMatchCompetitorText,I35<>AwaitingMatchCompetitorText),1,IF(AND(I34<>AwaitingMatchCompetitorText,I35<>AwaitingMatchCompetitorText),-1,0))","v":1},"09:00:00",null,null,5,null,null,{"$f":"CELL(\"address\",OFFSET($A$5,S32,0))","v":"$A$7"},{"$f":"IF(AND(NOT(ISBLANK(Q34)),Q34<>UnsetMatchCompetitorText,Q34<>AwaitingMatchCompetitorText,NOT(ISBLANK(Q35)),Q35<>UnsetMatchCompetitorText,Q35<>AwaitingMatchCompetitorText),1,IF(AND(Q34<>AwaitingMatchCompetitorText,Q35<>AwaitingMatchCompetitorText),-1,0))","v":1},"09:00:00",null,null,null,null,null,{"$f":"CELL(\"address\",OFFSET($A$5,AA32,0))","v":"$A$8"},{"$f":"IF(AND(NOT(ISBLANK(Y34)),Y34<>UnsetMatchCompetitorText,Y34<>AwaitingMatchCompetitorText,NOT(ISBLANK(Y35)),Y35<>UnsetMatchCompetitorText,Y35<>AwaitingMatchCompetitorText),1,IF(AND(Y34<>AwaitingMatchCompetitorText,Y35<>AwaitingMatchCompetitorText),-1,0))","v":1},"09:00:00",null,null,5,null,null,{"$f":"CELL(\"address\",OFFSET($A$5,AI32,0))","v":"$A$13"},{"$f":"IF(AND(NOT(ISBLANK(AG34)),AG34<>UnsetMatchCompetitorText,AG34<>AwaitingMatchCompetitorText,NOT(ISBLANK(AG35)),AG35<>UnsetMatchCompetitorText,AG35<>AwaitingMatchCompetitorText),1,IF(AND(AG34<>AwaitingMatchCompetitorText,AG35<>AwaitingMatchCompetitorText),-1,0))","v":1},"09:00:00"]
[null,null,null,null,null,null,"*",{"$f":"J32","v":21},{"$f":"IF(G34=\"*\",IF(AND(OFFSET(INDIRECT(G33),0,0)>0,NOT(ISNA(OFFSET(INDIRECT(G33),0,1)))),OFFSET(INDIRECT(G33),0,1),UnsetMatchCompetitorText),IF(OFFSET(INDIRECT(G33),2,5)>0,IF(COUNTIF(INDIRECT(G34),(OFFSET(INDIRECT(G33),0,5)))>0,OFFSET(INDIRECT(G33),0,1),IF(COUNTIF(INDIRECT(G34),(OFFSET(INDIRECT(G33),1,5)))>0,OFFSET(INDIRECT(G33),1,1),BlankMatchCompetitorText)),AwaitingMatchCompetitorText))","v":"Janez LAVRIČ"},null,null,1,"L",{"$f":"IF(M34=NormalWinState,AND(M35=NormalLoseState,L34>L35),TRUE)","v":true},"*",{"$f":"R32","v":22},{"$f":"IF(O34=\"*\",IF(AND(OFFSET(INDIRECT(O33),0,0)>0,NOT(ISNA(OFFSET(INDIRECT(O33),0,1)))),OFFSET(INDIRECT(O33),0,1),UnsetMatchCompetitorText),IF(OFFSET(INDIRECT(O33),2,5)>0,IF(COUNTIF(INDIRECT(O34),(OFFSET(INDIRECT(O33),0,5)))>0,OFFSET(INDIRECT(O33),0,1),IF(COUNTIF(INDIRECT(O34),(OFFSET(INDIRECT(O33),1,5)))>0,OFFSET(INDIRECT(O33),1,1),BlankMatchCompetitorText)),AwaitingMatchCompetitorText))","v":""},null,null,null,null,{"$f":"IF(U34=NormalWinState,AND(U35=NormalLoseState,T34>T35),TRUE)","v":true},"*",{"$f":"Z32","v":23},{"$f":"IF(W34=\"*\",IF(AND(OFFSET(INDIRECT(W33),0,0)>0,NOT(ISNA(OFFSET(INDIRECT(W33),0,1)))),OFFSET(INDIRECT(W33),0,1),UnsetMatchCompetitorText),IF(OFFSET(INDIRECT(W33),2,5)>0,IF(COUNTIF(INDIRECT(W34),(OFFSET(INDIRECT(W33),0,5)))>0,OFFSET(INDIRECT(W33),0,1),IF(COUNTIF(INDIRECT(W34),(OFFSET(INDIRECT(W33),1,5)))>0,OFFSET(INDIRECT(W33),1,1),BlankMatchCompetitorText)),AwaitingMatchCompetitorText))","v":"Beno MESSNER"},null,null,3,"L",{"$f":"IF(AC34=NormalWinState,AND(AC35=NormalLoseState,AB34>AB35),TRUE)","v":true},"*",{"$f":"AH32","v":24},{"$f":"IF(AE34=\"*\",IF(AND(OFFSET(INDIRECT(AE33),0,0)>0,NOT(ISNA(OFFSET(INDIRECT(AE33),0,1)))),OFFSET(INDIRECT(AE33),0,1),UnsetMatchCompetitorText),IF(OFFSET(INDIRECT(AE33),2,5)>0,IF(COUNTIF(INDIRECT(AE34),(OFFSET(INDIRECT(AE33),0,5)))>0,OFFSET(INDIRECT(AE33),0,1),IF(COUNTIF(INDIRECT(AE34),(OFFSET(INDIRECT(AE33),1,5)))>0,OFFSET(INDIRECT(AE33),1,1),BlankMatchCompetitorText)),AwaitingMatchCompetitorText))","v":"Jan HVALEC"},null,null,null,null,{"$f":"IF(AK34=NormalWinState,AND(AK35=NormalLoseState,AJ34>AJ35),TRUE)","v":true}]
[null,null,null,null,null,null,{"$f":"CELL(\"address\",OFFSET($A$5,L32,0))","v":"$A$11"},null,{"$f":"IF(G36=\"*\",IF(AND(OFFSET(INDIRECT(G35),0,0)>0,NOT(ISNA(OFFSET(INDIRECT(G35),0,1)))),OFFSET(INDIRECT(G35),0,1),UnsetMatchCompetitorText),IF(OFFSET(INDIRECT(G35),2,5)>0,IF(COUNTIF(INDIRECT(G36),(OFFSET(INDIRECT(G35),0,5)))>0,OFFSET(INDIRECT(G35),0,1),IF(COUNTIF(INDIRECT(G36),(OFFSET(INDIRECT(G35),1,5)))>0,OFFSET(INDIRECT(G35),1,1),BlankMatchCompetitorText)),AwaitingMatchCompetitorText))","v":"Matej BRAJKOVIČ"},null,null,5,"W",{"$f":"IF(M35=NormalWinState,AND(M34=NormalLoseState,L35>L34),TRUE)","v":true},{"$f":"CELL(\"address\",OFFSET($A$5,T32,0))","v":"$A$10"},null,{"$f":"IF(O36=\"*\",IF(AND(OFFSET(INDIRECT(O35),0,0)>0,NOT(ISNA(OFFSET(INDIRECT(O35),0,1)))),OFFSET(INDIRECT(O35),0,1),UnsetMatchCompetitorText),IF(OFFSET(INDIRECT(O35),2,5)>0,IF(COUNTIF(INDIRECT(O36),(OFFSET(INDIRECT(O35),0,5)))>0,OFFSET(INDIRECT(O35),0,1),IF(COUNTIF(INDIRECT(O36),(OFFSET(INDIRECT(O35),1,5)))>0,OFFSET(INDIRECT(O35),1,1),BlankMatchCompetitorText)),AwaitingMatchCompetitorText))","v":"Igor BAJSIČ"},null,null,null,null,{"$f":"IF(U35=NormalWinState,AND(U34=NormalLoseState,T35>T34),TRUE)","v":true},{"$f":"CELL(\"address\",OFFSET($A$5,AB32,0))","v":"$A$9"},null,{"$f":"IF(W36=\"*\",IF(AND(OFFSET(INDIRECT(W35),0,0)>0,NOT(ISNA(OFFSET(INDIRECT(W35),0,1)))),OFFSET(INDIRECT(W35),0,1),UnsetMatchCompetitorText),IF(OFFSET(INDIRECT(W35),2,5)>0,IF(COUNTIF(INDIRECT(W36),(OFFSET(INDIRECT(W35),0,5)))>0,OFFSET(INDIRECT(W35),0,1),IF(COUNTIF(INDIRECT(W36),(OFFSET(INDIRECT(W35),1,5)))>0,OFFSET(INDIRECT(W35),1,1),BlankMatchCompetitorText)),AwaitingMatchCompetitorText))","v":"Kristijan NIKL"},null,null,5,"W",{"$f":"IF(AC35=NormalWinState,AND(AC34=NormalLoseState,AB35>AB34),TRUE)","v":true},{"$f":"CELL(\"address\",OFFSET($A$5,AJ32,0))","v":"$A$12"},null,{"$f":"IF(AE36=\"*\",IF(AND(OFFSET(INDIRECT(AE35),0,0)>0,NOT(ISNA(OFFSET(INDIRECT(AE35),0,1)))),OFFSET(INDIRECT(AE35),0,1),UnsetMatchCompetitorText),IF(OFFSET(INDIRECT(AE35),2,5)>0,IF(COUNTIF(INDIRECT(AE36),(OFFSET(INDIRECT(AE35),0,5)))>0,OFFSET(INDIRECT(AE35),0,1),IF(COUNTIF(INDIRECT(AE36),(OFFSET(INDIRECT(AE35),1,5)))>0,OFFSET(INDIRECT(AE35),1,1),BlankMatchCompetitorText)),AwaitingMatchCompetitorText))","v":""},null,null,null,null,{"$f":"IF(AK35=NormalWinState,AND(AK34=NormalLoseState,AJ35>AJ34),TRUE)","v":true}]
[null,null,null,null,null,null,"*",5,"11:59:00","12:48:00",{"$f":"IF(ISBLANK(I36),\"\",IF(ISBLANK(J36),CurrentTime-I36,J36-I36))","v":"00:49:00"},"F",{"$f":"IF(AND(COUNTIF(FinishedMatchStates,L36),NOT(ISNA(VLOOKUP(M34,MatchCompetitorStateCodes,1,FALSE))),NOT(ISNA(VLOOKUP(M35,MatchCompetitorStateCodes,1,FALSE))),COUNTIF(WinStates,M34)+COUNTIF(WinStates,M35)<=1,COUNTIF(LoseStates,M34)+COUNTIF(LoseStates,M35)<=1,IF(M34=NormalWinState,AND(M35=NormalLoseState,L34>L35),TRUE),IF(M35=NormalWinState,AND(M34=NormalLoseState,L35>L34),TRUE),NOT(ISBLANK(L33)),NOT(ISBLANK(I33)),NOT(ISBLANK(I36)),NOT(ISBLANK(J36)),H33>0),1,IF(COUNTIF(FinishedMatchStates,L36)>0,-1,0))","v":1},null,"*",null,null,null,{"$f":"IF(ISBLANK(Q36),\"\",IF(ISBLANK(R36),CurrentTime-Q36,R36-Q36))","v":""},null,{"$f":"IF(AND(COUNTIF(FinishedMatchStates,T36),NOT(ISNA(VLOOKUP(U34,MatchCompetitorStateCodes,1,FALSE))),NOT(ISNA(VLOOKUP(U35,MatchCompetitorStateCodes,1,FALSE))),COUNTIF(WinStates,U34)+COUNTIF(WinStates,U35)<=1,COUNTIF(LoseStates,U34)+COUNTIF(LoseStates,U35)<=1,IF(U34=NormalWinState,AND(U35=NormalLoseState,T34>T35),TRUE),IF(U35=NormalWinState,AND(U34=NormalLoseState,T35>T34),TRUE),NOT(ISBLANK(T33)),NOT(ISBLANK(Q33)),NOT(ISBLANK(Q36)),NOT(ISBLANK(R36)),P33>0),1,IF(COUNTIF(FinishedMatchStates,T36)>0,-1,0))","v":0},null,"*",4,"11:59:00","12:58:00",{"$f":"IF(ISBLANK(Y36),\"\",IF(ISBLANK(Z36),CurrentTime-Y36,Z36-Y36))","v":"00:59:00"},"F",{"$f":"IF(AND(COUNTIF(FinishedMatchStates,AB36),NOT(ISNA(VLOOKUP(AC34,MatchCompetitorStateCodes,1,FALSE))),NOT(ISNA(VLOOKUP(AC35,MatchCompetitorStateCodes,1,FALSE))),COUNTIF(WinStates,AC34)+COUNTIF(WinStates,AC35)<=1,COUNTIF(LoseStates,AC34)+COUNTIF(LoseStates,AC35)<=1,IF(AC34=NormalWinState,AND(AC35=NormalLoseState,AB34>AB35),TRUE),IF(AC35=NormalWinState,AND(AC34=NormalLoseState,AB35>AB34),TRUE),NOT(ISBLANK(AB33)),NOT(ISBLANK(Y33)),NOT(ISBLANK(Y36)),NOT(ISBLANK(Z36)),X33>0),1,IF(COUNTIF(FinishedMatchStates,AB36)>0,-1,0))","v":1},null,"*",null,null,null,{"$f":"IF(ISBLANK(AG36),\"\",IF(ISBLANK(AH36),CurrentTime-AG36,AH36-AG36))","v":""},null,{"$f":"IF(AND(COUNTIF(FinishedMatchStates,AJ36),NOT(ISNA(VLOOKUP(AK34,MatchCompetitorStateCodes,1,FALSE))),NOT(ISNA(VLOOKUP(AK35,MatchCompetitorStateCodes,1,FALSE))),COUNTIF(WinStates,AK34)+COUNTIF(WinStates,AK35)<=1,COUNTIF(LoseStates,AK34)+COUNTIF(LoseStates,AK35)<=1,IF(AK34=NormalWinState,AND(AK35=NormalLoseState,AJ34>AJ35),TRUE),IF(AK35=NormalWinState,AND(AK34=NormalLoseState,AJ35>AJ34),TRUE),NOT(ISBLANK(AJ33)),NOT(ISBLANK(AG33)),NOT(ISBLANK(AG36)),NOT(ISBLANK(AH36)),AF33>0),1,IF(COUNTIF(FinishedMatchStates,AJ36)>0,-1,0))","v":0}]
[]
[null,null,null,null,null,null,{"$f":"G32","v":1},{"$f":"H32+1","v":7},{"$f":"I32","v":1},{"$f":"((H38-1)*$B$3)+I38","v":25},7,1,null,null,{"$f":"G38","v":1},{"$f":"H38","v":7},{"$f":"I38+1","v":2},{"$f":"((P38-1)*$B$3)+Q38","v":26},6,2,null,null,{"$f":"O38","v":1},{"$f":"P38","v":7},{"$f":"Q38+1","v":3},{"$f":"((X38-1)*$B$3)+Y38","v":27},5,3,null,null,{"$f":"W38","v":1},{"$f":"X38","v":7},{"$f":"Y38+1","v":4},{"$f":"((AF38-1)*$B$3)+AG38","v":28},4,8]
[null,null,null,null,null,null,{"$f":"CELL(\"address\",OFFSET($A$5,K38,0))","v":"$A$12"},{"$f":"IF(AND(NOT(ISBLANK(I40)),I40<>UnsetMatchCompetitorText,I40<>AwaitingMatchCompetitorText,NOT(ISBLANK(I41)),I41<>UnsetMatchCompetitorText,I41<>AwaitingMatchCompetitorText),1,IF(AND(I40<>AwaitingMatchCompetitorText,I41<>AwaitingMatchCompetitorText),-1,0))","v":1},"09:00:00",null,null,null,null,null,{"$f":"CELL(\"address\",OFFSET($A$5,S38,0))","v":"$A$11"},{"$f":"IF(AND(NOT(ISBLANK(Q40)),Q40<>UnsetMatchCompetitorText,Q40<>AwaitingMatchCompetitorText,NOT(ISBLANK(Q41)),Q41<>UnsetMatchCompetitorText,Q41<>AwaitingMatchCompetitorText),1,IF(AND(Q40<>AwaitingMatchCompetitorText,Q41<>AwaitingMatchCompetitorText),-1,0))","v":1},"09:00:00",null,null,null,null,null,{"$f":"CELL(\"address\",OFFSET($A$5,AA38,0))","v":"$A$10"},{"$f":"IF(AND(NOT(ISBLANK(Y40)),Y40<>UnsetMatchCompetitorText,Y40<>AwaitingMatchCompetitorText,NOT(ISBLANK(Y41)),Y41<>UnsetMatchCompetitorText,Y41<>AwaitingMatchCompetitorText),1,IF(AND(Y40<>AwaitingMatchCompetitorText,Y41<>AwaitingMatchCompetitorText),-1,0))","v":1},"09:00:00",null,null,5,null,null,{"$f":"CELL(\"address\",OFFSET($A$5,AI38,0))","v":"$A$9"},{"$f":"IF(AND(NOT(ISBLANK(AG40)),AG40<>UnsetMatchCompetitorText,AG40<>AwaitingMatchCompetitorText,NOT(ISBLANK(AG41)),AG41<>UnsetMatchCompetitorText,AG41<>AwaitingMatchCompetitorText),1,IF(AND(AG40<>AwaitingMatchCompetitorText,AG41<>AwaitingMatchCompetitorText),-1,0))","v":1},"09:00:00",null,null,5]
[null,null,null,null,null,null,"*",{"$f":"J38","v":25},{"$f":"IF(G40=\"*\",IF(AND(OFFSET(INDIRECT(G39),0,0)>0,NOT(ISNA(OFFSET(INDIRECT(G39),0,1)))),OFFSET(INDIRECT(G39),0,1),UnsetMatchCompetitorText),IF(OFFSET(INDIRECT(G39),2,5)>0,IF(COUNTIF(INDIRECT(G40),(OFFSET(INDIRECT(G39),0,5)))>0,OFFSET(INDIRECT(G39),0,1),IF(COUNTIF(INDIRECT(G40),(OFFSET(INDIRECT(G39),1,5)))>0,OFFSET(INDIRECT(G39),1,1),BlankMatchCompetitorText)),AwaitingMatchCompetitorText))","v":""},null,null,null,null,{"$f":"IF(M40=NormalWinState,AND(M41=NormalLoseState,L40>L41),TRUE)","v":true},"*",{"$f":"R38","v":26},{"$f":"IF(O40=\"*\",IF(AND(OFFSET(INDIRECT(O39),0,0)>0,NOT(ISNA(OFFSET(INDIRECT(O39),0,1)))),OFFSET(INDIRECT(O39),0,1),UnsetMatchCompetitorText),IF(OFFSET(INDIRECT(O39),2,5)>0,IF(COUNTIF(INDIRECT(O40),(OFFSET(INDIRECT(O39),0,5)))>0,OFFSET(INDIRECT(O39),0,1),IF(COUNTIF(INDIRECT(O40),(OFFSET(INDIRECT(O39),1,5)))>0,OFFSET(INDIRECT(O39),1,1),BlankMatchCompetitorText)),AwaitingMatchCompetitorText))","v":"Matej BRAJKOVIČ"},null,null,null,null,{"$f":"IF(U40=NormalWinState,AND(U41=NormalLoseState,T40>T41),TRUE)","v":true},"*",{"$f":"Z38","v":27},{"$f":"IF(W40=\"*\",IF(AND(OFFSET(INDIRECT(W39),0,0)>0,NOT(ISNA(OFFSET(INDIRECT(W39),0,1)))),OFFSET(INDIRECT(W39),0,1),UnsetMatchCompetitorText),IF(OFFSET(INDIRECT(W39),2,5)>0,IF(COUNTIF(INDIRECT(W40),(OFFSET(INDIRECT(W39),0,5)))>0,OFFSET(INDIRECT(W39),0,1),IF(COUNTIF(INDIRECT(W40),(OFFSET(INDIRECT(W39),1,5)))>0,OFFSET(INDIRECT(W39),1,1),BlankMatchCompetitorText)),AwaitingMatchCompetitorText))","v":"Igor BAJSIČ"},null,null,5,"W",{"$f":"IF(AC40=NormalWinState,AND(AC41=NormalLoseState,AB40>AB41),TRUE)","v":true},"*",{"$f":"AH38","v":28},{"$f":"IF(AE40=\"*\",IF(AND(OFFSET(INDIRECT(AE39),0,0)>0,NOT(ISNA(OFFSET(INDIRECT(AE39),0,1)))),OFFSET(INDIRECT(AE39),0,1),UnsetMatchCompetitorText),IF(OFFSET(INDIRECT(AE39),2,5)>0,IF(COUNTIF(INDIRECT(AE40),(OFFSET(INDIRECT(AE39),0,5)))>0,OFFSET(INDIRECT(AE39),0,1),IF(COUNTIF(INDIRECT(AE40),(OFFSET(INDIRECT(AE39),1,5)))>0,OFFSET(INDIRECT(AE39),1,1),BlankMatchCompetitorText)),AwaitingMatchCompetitorText))","v":"Kristijan NIKL"},null,null,5,"W",{"$f":"IF(AK40=NormalWinState,AND(AK41=NormalLoseState,AJ40>AJ41),TRUE)","v":true}]
[null,null,null,null,null,null,{"$f":"CELL(\"address\",OFFSET($A$5,L38,0))","v":"$A$6"},null,{"$f":"IF(G42=\"*\",IF(AND(OFFSET(INDIRECT(G41),0,0)>0,NOT(ISNA(OFFSET(INDIRECT(G41),0,1)))),OFFSET(INDIRECT(G41),0,1),UnsetMatchCompetitorText),IF(OFFSET(INDIRECT(G41),2,5)>0,IF(COUNTIF(INDIRECT(G42),(OFFSET(INDIRECT(G41),0,5)))>0,OFFSET(INDIRECT(G41),0,1),IF(COUNTIF(INDIRECT(G42),(OFFSET(INDIRECT(G41),1,5)))>0,OFFSET(INDIRECT(G41),1,1),BlankMatchCompetitorText)),AwaitingMatchCompetitorText))","v":"Janez LAVRIČ"},null,null,null,null,{"$f":"IF(M41=NormalWinState,AND(M40=NormalLoseState,L41>L40),TRUE)","v":true},{"$f":"CELL(\"address\",OFFSET($A$5,T38,0))","v":"$A$7"},null,{"$f":"IF(O42=\"*\",IF(AND(OFFSET(INDIRECT(O41),0,0)>0,NOT(ISNA(OFFSET(INDIRECT(O41),0,1)))),OFFSET(INDIRECT(O41),0,1),UnsetMatchCompetitorText),IF(OFFSET(INDIRECT(O41),2,5)>0,IF(COUNTIF(INDIRECT(O42),(OFFSET(INDIRECT(O41),0,5)))>0,OFFSET(INDIRECT(O41),0,1),IF(COUNTIF(INDIRECT(O42),(OFFSET(INDIRECT(O41),1,5)))>0,OFFSET(INDIRECT(O41),1,1),BlankMatchCompetitorText)),AwaitingMatchCompetitorText))","v":""},null,null,null,null,{"$f":"IF(U41=NormalWinState,AND(U40=NormalLoseState,T41>T40),TRUE)","v":true},{"$f":"CELL(\"address\",OFFSET($A$5,AB38,0))","v":"$A$8"},null,{"$f":"IF(W42=\"*\",IF(AND(OFFSET(INDIRECT(W41),0,0)>0,NOT(ISNA(OFFSET(INDIRECT(W41),0,1)))),OFFSET(INDIRECT(W41),0,1),UnsetMatchCompetitorText),IF(OFFSET(INDIRECT(W41),2,5)>0,IF(COUNTIF(INDIRECT(W42),(OFFSET(INDIRECT(W41),0,5)))>0,OFFSET(INDIRECT(W41),0,1),IF(COUNTIF(INDIRECT(W42),(OFFSET(INDIRECT(W41),1,5)))>0,OFFSET(INDIRECT(W41),1,1),BlankMatchCompetitorText)),AwaitingMatchCompetitorText))","v":"Beno MESSNER"},null,null,4,"L",{"$f":"IF(AC41=NormalWinState,AND(AC40=NormalLoseState,AB41>AB40),TRUE)","v":true},{"$f":"CELL(\"address\",OFFSET($A$5,AJ38,0))","v":"$A$13"},null,{"$f":"IF(AE42=\"*\",IF(AND(OFFSET(INDIRECT(AE41),0,0)>0,NOT(ISNA(OFFSET(INDIRECT(AE41),0,1)))),OFFSET(INDIRECT(AE41),0,1),UnsetMatchCompetitorText),IF(OFFSET(INDIRECT(AE41),2,5)>0,IF(COUNTIF(INDIRECT(AE42),(OFFSET(INDIRECT(AE41),0,5)))>0,OFFSET(INDIRECT(AE41),0,1),IF(COUNTIF(INDIRECT(AE42),(OFFSET(INDIRECT(AE41),1,5)))>0,OFFSET(INDIRECT(AE41),1,1),BlankMatchCompetitorText)),AwaitingMatchCompetitorText))","v":"Jan HVALEC"},null,null,1,"L",{"$f":"IF(AK41=NormalWinState,AND(AK40=NormalLoseState,AJ41>AJ40),TRUE)","v":true}]
[null,null,null,null,null,null,"*",null,null,null,{"$f":"IF(ISBLANK(I42),\"\",IF(ISBLANK(J42),CurrentTime-I42,J42-I42))","v":""},null,{"$f":"IF(AND(COUNTIF(FinishedMatchStates,L42),NOT(ISNA(VLOOKUP(M40,MatchCompetitorStateCodes,1,FALSE))),NOT(ISNA(VLOOKUP(M41,MatchCompetitorStateCodes,1,FALSE))),COUNTIF(WinStates,M40)+COUNTIF(WinStates,M41)<=1,COUNTIF(LoseStates,M40)+COUNTIF(LoseStates,M41)<=1,IF(M40=NormalWinState,AND(M41=NormalLoseState,L40>L41),TRUE),IF(M41=NormalWinState,AND(M40=NormalLoseState,L41>L40),TRUE),NOT(ISBLANK(L39)),NOT(ISBLANK(I39)),NOT(ISBLANK(I42)),NOT(ISBLANK(J42)),H39>0),1,IF(COUNTIF(FinishedMatchStates,L42)>0,-1,0))","v":0},null,"*",null,null,null,{"$f":"IF(ISBLANK(Q42),\"\",IF(ISBLANK(R42),CurrentTime-Q42,R42-Q42))","v":""},null,{"$f":"IF(AND(COUNTIF(FinishedMatchStates,T42),NOT(ISNA(VLOOKUP(U40,MatchCompetitorStateCodes,1,FALSE))),NOT(ISNA(VLOOKUP(U41,MatchCompetitorStateCodes,1,FALSE))),COUNTIF(WinStates,U40)+COUNTIF(WinStates,U41)<=1,COUNTIF(LoseStates,U40)+COUNTIF(LoseStates,U41)<=1,IF(U40=NormalWinState,AND(U41=NormalLoseState,T40>T41),TRUE),IF(U41=NormalWinState,AND(U40=NormalLoseState,T41>T40),TRUE),NOT(ISBLANK(T39)),NOT(ISBLANK(Q39)),NOT(ISBLANK(Q42)),NOT(ISBLANK(R42)),P39>0),1,IF(COUNTIF(FinishedMatchStates,T42)>0,-1,0))","v":0},null,"*",4,"14:30:00","15:34:00",{"$f":"IF(ISBLANK(Y42),\"\",IF(ISBLANK(Z42),CurrentTime-Y42,Z42-Y42))","v":"01:04:00"},"F",{"$f":"IF(AND(COUNTIF(FinishedMatchStates,AB42),NOT(ISNA(VLOOKUP(AC40,MatchCompetitorStateCodes,1,FALSE))),NOT(ISNA(VLOOKUP(AC41,MatchCompetitorStateCodes,1,FALSE))),COUNTIF(WinStates,AC40)+COUNTIF(WinStates,AC41)<=1,COUNTIF(LoseStates,AC40)+COUNTIF(LoseStates,AC41)<=1,IF(AC40=NormalWinState,AND(AC41=NormalLoseState,AB40>AB41),TRUE),IF(AC41=NormalWinState,AND(AC40=NormalLoseState,AB41>AB40),TRUE),NOT(ISBLANK(AB39)),NOT(ISBLANK(Y39)),NOT(ISBLANK(Y42)),NOT(ISBLANK(Z42)),X39>0),1,IF(COUNTIF(FinishedMatchStates,AB42)>0,-1,0))","v":1},null,"*",6,"11:05:00","11:35:00",{"$f":"IF(ISBLANK(AG42),\"\",IF(ISBLANK(AH42),CurrentTime-AG42,AH42-AG42))","v":"00:30:00"},"F",{"$f":"IF(AND(COUNTIF(FinishedMatchStates,AJ42),NOT(ISNA(VLOOKUP(AK40,MatchCompetitorStateCodes,1,FALSE))),NOT(ISNA(VLOOKUP(AK41,MatchCompetitorStateCodes,1,FALSE))),COUNTIF(WinStates,AK40)+COUNTIF(WinStates,AK41)<=1,COUNTIF(LoseStates,AK40)+COUNTIF(LoseStates,AK41)<=1,IF(AK40=NormalWinState,AND(AK41=NormalLoseState,AJ40>AJ41),TRUE),IF(AK41=NormalWinState,AND(AK40=NormalLoseState,AJ41>AJ40),TRUE),NOT(ISBLANK(AJ39)),NOT(ISBLANK(AG39)),NOT(ISBLANK(AG42)),NOT(ISBLANK(AH42)),AF39>0),1,IF(COUNTIF(FinishedMatchStates,AJ42)>0,-1,0))","v":1}]

{"sheet":"Skupina 3","index":5,"n_rows":42,"n_cols":101,"rows_kept":42,"cut":false,"hidden":false,"merged":[[0,0,0,4],[2,9,2,10],[2,17,2,18],[2,25,2,26],[2,33,2,34],[3,7,4,7],[3,8,3,10],[3,15,4,15],[3,16,3,18],[3,23,4,23],[5,53,6,53],[7,53,8,53],[8,9,8,10],[8,17,8,18],[8,25,8,26],[8,33,8,34],[3,24,3,26],[3,31,4,31],[3,32,3,34],[3,53,4,53],[4,8,4,10],[4,16,4,18],[4,24,4,26],[4,32,4,34],[15,7,16,7],[15,8,15,10],[15,15,16,15],[15,16,15,18],[15,23,16,23],[15,24,15,26],[9,31,10,31],[9,32,9,34],[9,53,10,53],[10,8,10,10],[10,16,10,18],[10,24,10,26],[10,32,10,34],[9,7,10,7],[9,8,9,10],[9,15,10,15],[9,16,9,18],[9,23,10,23],[9,24,9,26],[15,31,16,31],[15,32,15,34],[16,8,16,10],[16,16,16,18],[16,24,16,26],[16,32,16,34],[14,9,14,10],[14,17,14,18],[14,25,14,26],[14,33,14,34],[20,9,20,10],[20,17,20,18],[20,25,20,26],[20,33,20,34],[21,7,22,7],[21,8,21,10],[21,15,22,15],[21,16,21,18],[21,23,22,23],[21,24,21,26],[27,7,28,7],[27,8,27,10],[27,15,28,15],[27,16,27,18],[27,23,28,23],[27,24,27,26],[21,31,22,31],[21,32,21,34],[22,8,22,10],[22,16,22,18],[22,24,22,26],[22,32,22,34],[27,31,28,31],[27,32,27,34],[28,8,28,10],[28,16,28,18],[28,24,28,26],[28,32,28,34],[26,9,26,10],[26,17,26,18],[26,25,26,26],[26,33,26,34],[32,9,32,10],[32,17,32,18],[32,25,32,26],[32,33,32,34],[33,7,34,7],[33,8,33,10],[33,15,34,15],[33,16,33,18],[33,23,34,23],[33,24,33,26],[39,7,40,7],[39,8,39,10],[39,15,40,15],[39,16,39,18],[39,23,40,23],[39,24,39,26],[33,31,34,31],[33,32,33,34],[34,8,34,10],[34,16,34,18],[34,24,34,26],[34,32,34,34],[39,31,40,31],[39,32,39,34],[40,8,40,10],[40,16,40,18],[40,24,40,26],[40,32,40,34],[38,9,38,10],[38,17,38,18],[38,25,38,26],[38,33,38,34]]}
["Nastavitve",null,null,null,null,null,"Group","Round","Order","Match","P1","P2",null,null,null,null,null,null,null,null,null,null,null,null,null,null,null,null,null,null,null,null,null,null,null,null,null,null,null,null,null,null,null,null,null,null,null,null,null,null,null,null,null,null,null,null,null,null,null,null,null,null,null,null,null,null,null,null,null,null,null,null,null,null,null,null,null,null,"Match","Row","Col","Address","Group","Match nr.","Table","Scheduled time","Target","Notes","Start time","End time","Duration","P1 Name","P1 Code","P1 Score","P1 State","P2 Name","P2 Code","P2 Score","P2 State","Match State","Is Valid"]
["Skupina",3,null,null,null,null,1,1,1,{"$f":"((H2-1)*$B$3)+I2","v":1},2,7,null,null,{"$f":"G2","v":1},{"$f":"H2","v":1},{"$f":"I2+1","v":2},{"$f":"((P2-1)*$B$3)+Q2","v":2},3,6,null,null,{"$f":"O2","v":1},{"$f":"P2","v":1},{"$f":"Q2+1","v":3},{"$f":"((X2-1)*$B$3)+Y2","v":3},4,5,null,null,{"$f":"W2","v":1},{"$f":"X2","v":1},{"$f":"Y2+1","v":4},{"$f":"((AF2-1)*$B$3)+AG2","v":4},1,8,null,null,null,null,null,null,null,null,null,null,null,null,null,null,null,null,null,null,null,null,null,null,null,null,null,null,null,null,null,null,null,null,null,null,null,null,null,null,null,null,null,null,1,{"$f":"ROW(H4)","v":4},{"$f":"COLUMN(H4)","v":8},{"$f":"ADDRESS(CB2,CC2)","v":"$H$4"},{"$f":"CONCATENATE($B$2)","v":"3"},{"$f":"INDIRECT(CD2)","v":1},{"$f":"CONCATENATE(OFFSET(INDIRECT(CD2),2,0))","v":""},{"$f":"OFFSET(INDIRECT(CD2),-1,1)","v":"09:00:00"},{"$f":"OFFSET(INDIRECT(CD2),-1,4)","v":0},{"$f":"CONCATENATE(OFFSET(INDIRECT(CD2),-1,2))","v":""},{"$f":"OFFSET(INDIRECT(CD2),2,1)","v":"00:00:00"},{"$f":"OFFSET(INDIRECT(CD2),2,2)","v":"00:00:00"},{"$f":"OFFSET(INDIRECT(CD2),2,3)","v":""},{"$f":"OFFSET(INDIRECT(CD2),0,1)","v":""},{"$f":"VLOOKUP(CN2,AnnouncementListCompetitors,6,FALSE)","v":0},{"$f":"OFFSET(INDIRECT(CD2),0,4)","v":0},{"$f":"OFFSET(INDIRECT(CD2),0,5)","v":0},{"$f":"OFFSET(INDIRECT(CD2),1,1)","v":""},{"$f":"VLOOKUP(CR2,AnnouncementListCompetitors,6,FALSE)","v":0},{"$f":"OFFSET(INDIRECT(CD2),1,4)","v":0},{"$f":"OFFSET(INDIRECT(CD2),1,5)","v":0},{"$f":"OFFSET(INDIRECT(CD2),2,4)","v":0},{"$f":"IF(OFFSET(INDIRECT(CD2),2,5)=1,TRUE,FALSE)","v":false}]
["Št. dvobojev na kolo",4,null,null,null,null,{"$f":"CELL(\"address\",OFFSET($A$5,K2,0))","v":"$A$7"},{"$f":"IF(AND(NOT(ISBLANK(I4)),I4<>UnsetMatchCompetitorText,I4<>AwaitingMatchCompetitorText,NOT(ISBLANK(I5)),I5<>UnsetMatchCompetitorText,I5<>AwaitingMatchCompetitorText),1,IF(AND(I4<>AwaitingMatchCompetitorText,I5<>AwaitingMatchCompetitorText),-1,0))","v":1},"09:00:00",null,null,null,null,null,{"$f":"CELL(\"address\",OFFSET($A$5,S2,0))","v":"$A$8"},{"$f":"IF(AND(NOT(ISBLANK(Q4)),Q4<>UnsetMatchCompetitorText,Q4<>AwaitingMatchCompetitorText,NOT(ISBLANK(Q5)),Q5<>UnsetMatchCompetitorText,Q5<>AwaitingMatchCompetitorText),1,IF(AND(Q4<>AwaitingMatchCompetitorText,Q5<>AwaitingMatchCompetitorText),-1,0))","v":1},"09:00:00",null,null,5,null,null,{"$f":"CELL(\"address\",OFFSET($A$5,AA2,0))","v":"$A$9"},{"$f":"IF(AND(NOT(ISBLANK(Y4)),Y4<>UnsetMatchCompetitorText,Y4<>AwaitingMatchCompetitorText,NOT(ISBLANK(Y5)),Y5<>UnsetMatchCompetitorText,Y5<>AwaitingMatchCompetitorText),1,IF(AND(Y4<>AwaitingMatchCompetitorText,Y5<>AwaitingMatchCompetitorText),-1,0))","v":1},"09:00:00",null,null,5,null,null,{"$f":"CELL(\"address\",OFFSET($A$5,AI2,0))","v":"$A$6"},{"$f":"IF(AND(NOT(ISBLANK(AG4)),AG4<>UnsetMatchCompetitorText,AG4<>AwaitingMatchCompetitorText,NOT(ISBLANK(AG5)),AG5<>UnsetMatchCompetitorText,AG5<>AwaitingMatchCompetitorText),1,IF(AND(AG4<>AwaitingMatchCompetitorText,AG5<>AwaitingMatchCompetitorText),-1,0))","v":1},"09:00:00",null,null,5,null,null,null,null,null,null,null,null,null,null,null,null,null,null,null,null,null,null,"Tekmovalec","Tekme","+","-","+/-","Zmage","Poz.","Uvrst.","Žreb",null,null,"R",null,"S",null,null,null,null,null,null,null,null,null,null,2,{"$f":"CB2","v":4},{"$f":"CC2+8","v":16},"$P$4",{"$f":"CONCATENATE($B$2)","v":"3"},2,"5","09:00:00",5,"","10:51:00","11:33:00","00:42:00","Boštjan PEMIČ",678,2,"L","Miha ŽAGAR",2,5,"W","F",true]
[null,null,null,null,null,null,"*",{"$f":"J2","v":1},{"$f":"IF(G4=\"*\",IF(AND(OFFSET(INDIRECT(G3),0,0)>0,NOT(ISNA(OFFSET(INDIRECT(G3),0,1)))),OFFSET(INDIRECT(G3),0,1),UnsetMatchCompetitorText),IF(OFFSET(INDIRECT(G3),2,5)>0,IF(COUNTIF(INDIRECT(G4),(OFFSET(INDIRECT(G3),0,5)))>0,OFFSET(INDIRECT(G3),0,1),IF(COUNTIF(INDIRECT(G4),(OFFSET(INDIRECT(G3),1,5)))>0,OFFSET(INDIRECT(G3),1,1),BlankMatchCompetitorText)),AwaitingMatchCompetitorText))","v":""},null,null,null,null,{"$f":"IF(M4=NormalWinState,AND(M5=NormalLoseState,L4>L5),TRUE)","v":true},"*",{"$f":"R2","v":2},{"$f":"IF(O4=\"*\",IF(AND(OFFSET(INDIRECT(O3),0,0)>0,NOT(ISNA(OFFSET(INDIRECT(O3),0,1)))),OFFSET(INDIRECT(O3),0,1),UnsetMatchCompetitorText),IF(OFFSET(INDIRECT(O3),2,5)>0,IF(COUNTIF(INDIRECT(O4),(OFFSET(INDIRECT(O3),0,5)))>0,OFFSET(INDIRECT(O3),0,1),IF(COUNTIF(INDIRECT(O4),(OFFSET(INDIRECT(O3),1,5)))>0,OFFSET(INDIRECT(O3),1,1),BlankMatchCompetitorText)),AwaitingMatchCompetitorText))","v":"Boštjan PEMIČ"},null,null,2,"L",{"$f":"IF(U4=NormalWinState,AND(U5=NormalLoseState,T4>T5),TRUE)","v":true},"*",{"$f":"Z2","v":3},{"$f":"IF(W4=\"*\",IF(AND(OFFSET(INDIRECT(W3),0,0)>0,NOT(ISNA(OFFSET(INDIRECT(W3),0,1)))),OFFSET(INDIRECT(W3),0,1),UnsetMatchCompetitorText),IF(OFFSET(INDIRECT(W3),2,5)>0,IF(COUNTIF(INDIRECT(W4),(OFFSET(INDIRECT(W3),0,5)))>0,OFFSET(INDIRECT(W3),0,1),IF(COUNTIF(INDIRECT(W4),(OFFSET(INDIRECT(W3),1,5)))>0,OFFSET(INDIRECT(W3),1,1),BlankMatchCompetitorText)),AwaitingMatchCompetitorText))","v":"Iztok DOLINŠEK "},null,null,4,"L",{"$f":"IF(AC4=NormalWinState,AND(AC5=NormalLoseState,AB4>AB5),TRUE)","v":true},"*",{"$f":"AH2","v":4},{"$f":"IF(AE4=\"*\",IF(AND(OFFSET(INDIRECT(AE3),0,0)>0,NOT(ISNA(OFFSET(INDIRECT(AE3),0,1)))),OFFSET(INDIRECT(AE3),0,1),UnsetMatchCompetitorText),IF(OFFSET(INDIRECT(AE3),2,5)>0,IF(COUNTIF(INDIRECT(AE4),(OFFSET(INDIRECT(AE3),0,5)))>0,OFFSET(INDIRECT(AE3),0,1),IF(COUNTIF(INDIRECT(AE4),(OFFSET(INDIRECT(AE3),1,5)))>0,OFFSET(INDIRECT(AE3),1,1),BlankMatchCompetitorText)),AwaitingMatchCompetitorText))","v":"Peter FIJAVŽ"},null,null,5,"W",{"$f":"IF(AK4=NormalWinState,AND(AK5=NormalLoseState,AJ4>AJ5),TRUE)","v":true},null,null,null,null,null,null,null,null,null,null,null,null,null,null,null,null,{"$f":"B6","v":"Peter FIJAVŽ"},{"$f":"IF(COUNTIF(FinishedMatchStates,AJ6),1,0)+IF(L12=FinishedMatchStates,1,0)+IF(L18=FinishedMatchStates,1,0)+IF(L24=FinishedMatchStates,1,0)+IF(L30=FinishedMatchStates,1,0)+IF(L36=FinishedMatchStates,1,0)+IF(L42=FinishedMatchStates,1,0)","v":5},{"$f":"AJ4+L10+L17+L22+L29+L34+L41","v":17},{"$f":"AJ5+L11+L16+L23+L28+L35+L40","v":15},{"$f":"BE4-BF4","v":2},{"$f":"IF(COUNTIF(WinStates,AK4),1,0)+IF(COUNTIF(WinStates,M10),1,0)+IF(COUNTIF(WinStates,M17),1,0)+IF(COUNTIF(WinStates,M22),1,0)+IF(COUNTIF(WinStates,M29),1,0)+IF(COUNTIF(WinStates,M34),1,0)+IF(COUNTIF(WinStates,M41),1,0)","v":3},{"$f":"8-IF(BH4>=BH5,1,0)-IF(BH4>=BH6,1,0)-IF(BH4>=BH7,1,0)-IF(BH4>=BH8,1,0)-IF(BH4>=BH9,1,0)-IF(BH4>=BH10,1,0)-IF(BH4>=BH11,1,0)","v":2},null,null,null,null,{"$f":"BJ4","v":0},{"$f":"BC4","v":"Peter FIJAVŽ"},{"$f":"IF(ISBLANK(BK4),\"\",BK4)","v":""},null,null,null,null,null,null,null,null,null,null,3,{"$f":"CB3","v":4},{"$f":"CC3+8","v":24},"$X$4",{"$f":"CONCATENATE($B$2)","v":"3"},3,"6","09:00:00",5,"","09:11:00","11:03:00","01:52:00","Iztok DOLINŠEK ",111,4,"L","Aleksander RAIŠIČ",220,5,"W","F",true]
["Poz.","Tekmovalec",null,null,null,null,{"$f":"CELL(\"address\",OFFSET($A$5,L2,0))","v":"$A$12"},null,{"$f":"IF(G6=\"*\",IF(AND(OFFSET(INDIRECT(G5),0,0)>0,NOT(ISNA(OFFSET(INDIRECT(G5),0,1)))),OFFSET(INDIRECT(G5),0,1),UnsetMatchCompetitorText),IF(OFFSET(INDIRECT(G5),2,5)>0,IF(COUNTIF(INDIRECT(G6),(OFFSET(INDIRECT(G5),0,5)))>0,OFFSET(INDIRECT(G5),0,1),IF(COUNTIF(INDIRECT(G6),(OFFSET(INDIRECT(G5),1,5)))>0,OFFSET(INDIRECT(G5),1,1),BlankMatchCompetitorText)),AwaitingMatchCompetitorText))","v":""},null,null,null,null,{"$f":"IF(M5=NormalWinState,AND(M4=NormalLoseState,L5>L4),TRUE)","v":true},{"$f":"CELL(\"address\",OFFSET($A$5,T2,0))","v":"$A$11"},null,{"$f":"IF(O6=\"*\",IF(AND(OFFSET(INDIRECT(O5),0,0)>0,NOT(ISNA(OFFSET(INDIRECT(O5),0,1)))),OFFSET(INDIRECT(O5),0,1),UnsetMatchCompetitorText),IF(OFFSET(INDIRECT(O5),2,5)>0,IF(COUNTIF(INDIRECT(O6),(OFFSET(INDIRECT(O5),0,5)))>0,OFFSET(INDIRECT(O5),0,1),IF(COUNTIF(INDIRECT(O6),(OFFSET(INDIRECT(O5),1,5)))>0,OFFSET(INDIRECT(O5),1,1),BlankMatchCompetitorText)),AwaitingMatchCompetitorText))","v":"Miha ŽAGAR"},null,null,5,"W",{"$f":"IF(U5=NormalWinState,AND(U4=NormalLoseState,T5>T4),TRUE)","v":true},{"$f":"CELL(\"address\",OFFSET($A$5,AB2,0))","v":"$A$10"},null,{"$f":"IF(W6=\"*\",IF(AND(OFFSET(INDIRECT(W5),0,0)>0,NOT(ISNA(OFFSET(INDIRECT(W5),0,1)))),OFFSET(INDIRECT(W5),0,1),UnsetMatchCompetitorText),IF(OFFSET(INDIRECT(W5),2,5)>0,IF(COUNTIF(INDIRECT(W6),(OFFSET(INDIRECT(W5),0,5)))>0,OFFSET(INDIRECT(W5),0,1),IF(COUNTIF(INDIRECT(W6),(OFFSET(INDIRECT(W5),1,5)))>0,OFFSET(INDIRECT(W5),1,1),BlankMatchCompetitorText)),AwaitingMatchCompetitorText))","v":"Aleksander RAIŠIČ"},null,null,5,"W",{"$f":"IF(AC5=NormalWinState,AND(AC4=NormalLoseState,AB5>AB4),TRUE)","v":true},{"$f":"CELL(\"address\",OFFSET($A$5,AJ2,0))","v":"$A$13"},null,{"$f":"IF(AE6=\"*\",IF(AND(OFFSET(INDIRECT(AE5),0,0)>0,NOT(ISNA(OFFSET(INDIRECT(AE5),0,1)))),OFFSET(INDIRECT(AE5),0,1),UnsetMatchCompetitorText),IF(OFFSET(INDIRECT(AE5),2,5)>0,IF(COUNTIF(INDIRECT(AE6),(OFFSET(INDIRECT(AE5),0,5)))>0,OFFSET(INDIRECT(AE5),0,1),IF(COUNTIF(INDIRECT(AE6),(OFFSET(INDIRECT(AE5),1,5)))>0,OFFSET(INDIRECT(AE5),1,1),BlankMatchCompetitorText)),AwaitingMatchCompetitorText))","v":"Jožef GATEJ"},null,null,3,"L",{"$f":"IF(AK5=NormalWinState,AND(AK4=NormalLoseState,AJ5>AJ4),TRUE)","v":true},null,null,null,null,null,null,null,null,null,null,null,null,null,null,null,null,"",{"$f":"IF(L6=FinishedMatchStates,1,0)+IF(L12=FinishedMatchStates,1,0)+IF(AJ18=FinishedMatchStates,1,0)+IF(T24=FinishedMatchStates,1,0)+IF(T30=FinishedMatchStates,1,0)+IF(T36=FinishedMatchStates,1,0)+IF(T42=FinishedMatchStates,1,0)","v":0},{"$f":"L4+L11+AJ16+T22+T29+T34+T41","v":0},{"$f":"L5+L10+AJ17+T23+T28+T35+T40","v":0},0,{"$f":"IF(COUNTIF(WinStates,M4),1,0)+IF(COUNTIF(WinStates,M11),1,0)+IF(COUNTIF(WinStates,AK16),1,0)+IF(COUNTIF(WinStates,U22),1,0)+IF(COUNTIF(WinStates,U29),1,0)+IF(COUNTIF(WinStates,U34),1,0)+IF(COUNTIF(WinStates,U41),1,0)","v":0},{"$f":"8-IF(BH5>=BH4,1,0)-IF(BH5>=BH6,1,0)-IF(BH5>=BH7,1,0)-IF(BH5>=BH8,1,0)-IF(BH5>=BH9,1,0)-IF(BH5>=BH10,1,0)-IF(BH5>=BH11,1,0)","v":7},null,null,null,null,{"$f":"BJ5","v":0},{"$f":"BC5","v":""},"",null,null,null,null,null,null,null,null,null,null,4,{"$f":"CB4","v":4},{"$f":"CC4+8","v":32},"$AF$4",{"$f":"CONCATENATE($B$2)","v":"3"},4,"5","09:00:00",5,"","09:11:00","09:53:00","00:42:00","Peter FIJAVŽ",910,5,"W","Jožef GATEJ",905,3,"L","F",true]
[{"$f":"($B$2-1)*TournamentGroupSize+1","v":17},{"$f":"VLOOKUP(A6,DrawSheetPositionCompetitorsQualification,2,FALSE)","v":"Peter FIJAVŽ"},null,null,null,null,"*",null,null,null,{"$f":"IF(ISBLANK(I6),\"\",IF(ISBLANK(J6),CurrentTime-I6,J6-I6))","v":""},null,{"$f":"IF(AND(COUNTIF(FinishedMatchStates,L6),NOT(ISNA(VLOOKUP(M4,MatchCompetitorStateCodes,1,FALSE))),NOT(ISNA(VLOOKUP(M5,MatchCompetitorStateCodes,1,FALSE))),COUNTIF(WinStates,M4)+COUNTIF(WinStates,M5)<=1,COUNTIF(LoseStates,M4)+COUNTIF(LoseStates,M5)<=1,IF(M4=NormalWinState,AND(M5=NormalLoseState,L4>L5),TRUE),IF(M5=NormalWinState,AND(M4=NormalLoseState,L5>L4),TRUE),NOT(ISBLANK(L3)),NOT(ISBLANK(I3)),NOT(ISBLANK(I6)),NOT(ISBLANK(J6)),H3>0),1,IF(COUNTIF(FinishedMatchStates,L6)>0,-1,0))","v":0},null,"*",5,"10:51:00","11:33:00",{"$f":"IF(ISBLANK(Q6),\"\",IF(ISBLANK(R6),CurrentTime-Q6,R6-Q6))","v":"00:42:00"},"F",{"$f":"IF(AND(COUNTIF(FinishedMatchStates,T6),NOT(ISNA(VLOOKUP(U4,MatchCompetitorStateCodes,1,FALSE))),NOT(ISNA(VLOOKUP(U5,MatchCompetitorStateCodes,1,FALSE))),COUNTIF(WinStates,U4)+COUNTIF(WinStates,U5)<=1,COUNTIF(LoseStates,U4)+COUNTIF(LoseStates,U5)<=1,IF(U4=NormalWinState,AND(U5=NormalLoseState,T4>T5),TRUE),IF(U5=NormalWinState,AND(U4=NormalLoseState,T5>T4),TRUE),NOT(ISBLANK(T3)),NOT(ISBLANK(Q3)),NOT(ISBLANK(Q6)),NOT(ISBLANK(R6)),P3>0),1,IF(COUNTIF(FinishedMatchStates,T6)>0,-1,0))","v":1},null,"*",6,"09:11:00","11:03:00",{"$f":"IF(ISBLANK(Y6),\"\",IF(ISBLANK(Z6),CurrentTime-Y6,Z6-Y6))","v":"01:52:00"},"F",{"$f":"IF(AND(COUNTIF(FinishedMatchStates,AB6),NOT(ISNA(VLOOKUP(AC4,MatchCompetitorStateCodes,1,FALSE))),NOT(ISNA(VLOOKUP(AC5,MatchCompetitorStateCodes,1,FALSE))),COUNTIF(WinStates,AC4)+COUNTIF(WinStates,AC5)<=1,COUNTIF(LoseStates,AC4)+COUNTIF(LoseStates,AC5)<=1,IF(AC4=NormalWinState,AND(AC5=NormalLoseState,AB4>AB5),TRUE),IF(AC5=NormalWinState,AND(AC4=NormalLoseState,AB5>AB4),TRUE),NOT(ISBLANK(AB3)),NOT(ISBLANK(Y3)),NOT(ISBLANK(Y6)),NOT(ISBLANK(Z6)),X3>0),1,IF(COUNTIF(FinishedMatchStates,AB6)>0,-1,0))","v":1},null,"*",5,"09:11:00","09:53:00",{"$f":"IF(ISBLANK(AG6),\"\",IF(ISBLANK(AH6),CurrentTime-AG6,AH6-AG6))","v":"00:42:00"},"F",{"$f":"IF(AND(COUNTIF(FinishedMatchStates,AJ6),NOT(ISNA(VLOOKUP(AK4,MatchCompetitorStateCodes,1,FALSE))),NOT(ISNA(VLOOKUP(AK5,MatchCompetitorStateCodes,1,FALSE))),COUNTIF(WinStates,AK4)+COUNTIF(WinStates,AK5)<=1,COUNTIF(LoseStates,AK4)+COUNTIF(LoseStates,AK5)<=1,IF(AK4=NormalWinState,AND(AK5=NormalLoseState,AJ4>AJ5),TRUE),IF(AK5=NormalWinState,AND(AK4=NormalLoseState,AJ5>AJ4),TRUE),NOT(ISBLANK(AJ3)),NOT(ISBLANK(AG3)),NOT(ISBLANK(AG6)),NOT(ISBLANK(AH6)),AF3>0),1,IF(COUNTIF(FinishedMatchStates,AJ6)>0,-1,0))","v":1},null,null,null,null,null,null,null,null,null,null,null,null,null,null,null,null,null,"Boštjan PEMIČ",{"$f":"IF(T6=FinishedMatchStates,1,0)+IF(T12=FinishedMatchStates,1,0)+IF(L18=FinishedMatchStates,1,0)+IF(T24=FinishedMatchStates,1,0)+IF(AJ30=FinishedMatchStates,1,0)+IF(AB36=FinishedMatchStates,1,0)+IF(AB42=FinishedMatchStates,1,0)","v":5},{"$f":"T4+T11+L16+T23+AJ28+AB34+AB41","v":12},{"$f":"T5+T10+L17+T22+AJ29+AB35+AB40","v":21},-9,{"$f":"IF(COUNTIF(WinStates,U4),1,0)+IF(COUNTIF(WinStates,U11),1,0)+IF(COUNTIF(WinStates,M16),1,0)+IF(COUNTIF(WinStates,U23),1,0)+IF(COUNTIF(WinStates,AK28),1,0)+IF(COUNTIF(WinStates,AC34),1,0)+IF(COUNTIF(WinStates,AC41),1,0)","v":1},{"$f":"8-IF(BH6>=BH5,1,0)-IF(BH6>=BH4,1,0)-IF(BH6>=BH7,1,0)-IF(BH6>=BH8,1,0)-IF(BH6>=BH9,1,0)-IF(BH6>=BH10,1,0)-IF(BH6>=BH11,1,0)","v":6},null,null,null,null,0,"Boštjan PEMIČ",{"$f":"IF(ISBLANK(BK6),\"\",BK6)","v":""},null,null,null,null,null,null,null,null,null,null,5,{"$f":"CB2+6","v":10},{"$f":"CC2","v":8},"$H$10",{"$f":"CONCATENATE($B$2)","v":"3"},5,"","09:00:00",0,"","00:00:00","00:00:00","","Peter FIJAVŽ",910,0,0,"",0,0,0,0,false]
[{"$f":"A6+1","v":18},"",null,null,null,null,null,null,null,null,null,null,null,null,null,null,null,null,null,null,null,null,null,null,null,null,null,null,null,null,null,null,null,null,null,null,null,null,null,null,null,null,null,null,null,null,null,null,null,null,null,null,null,null,"Iztok DOLINŠEK ",{"$f":"IF(AB6=FinishedMatchStates,1,0)+IF(AB12=FinishedMatchStates,1,0)+IF(T18=FinishedMatchStates,1,0)+IF(L24=FinishedMatchStates,1,0)+IF(T30=FinishedMatchStates,1,0)+IF(AB36=FinishedMatchStates,1,0)+IF(AJ42=FinishedMatchStates,1,0)","v":5},{"$f":"AB4+AB11+T16+L23+T28+AB35+AJ40","v":18},{"$f":"AB5+AB10+T17+L22+T29+AB34+AJ41","v":20},-2,{"$f":"IF(COUNTIF(WinStates,AC4),1,0)+IF(COUNTIF(WinStates,AC11),1,0)+IF(COUNTIF(WinStates,U16),1,0)+IF(COUNTIF(WinStates,M23),1,0)+IF(COUNTIF(WinStates,U28),1,0)+IF(COUNTIF(WinStates,AC35),1,0)+IF(COUNTIF(WinStates,AK40),1,0)","v":2},{"$f":"8-IF(BH7>=BH5,1,0)-IF(BH7>=BH6,1,0)-IF(BH7>=BH4,1,0)-IF(BH7>=BH8,1,0)-IF(BH7>=BH9,1,0)-IF(BH7>=BH10,1,0)-IF(BH7>=BH11,1,0)","v":4},null,null,null,null,0,"Iztok DOLINŠEK ",{"$f":"IF(ISBLANK(BK7),\"\",BK7)","v":""},null,null,null,null,null,null,null,null,null,null,6,{"$f":"CB6","v":10},{"$f":"CC6+8","v":16},"$P$10",{"$f":"CONCATENATE($B$2)","v":"3"},6,"","09:00:00",0,"","00:00:00","00:00:00","","",0,0,0,"Boštjan PEMIČ",678,0,0,0,false]
[{"$f":"A7+1","v":19},"Boštjan PEMIČ",null,null,null,null,{"$f":"G2","v":1},{"$f":"H2+1","v":2},{"$f":"I2","v":1},{"$f":"((H8-1)*$B$3)+I8","v":5},1,2,null,null,{"$f":"G8","v":1},{"$f":"H8","v":2},{"$f":"I8+1","v":2},{"$f":"((P8-1)*$B$3)+Q8","v":6},7,3,null,null,{"$f":"O8","v":1},{"$f":"P8","v":2},{"$f":"Q8+1","v":3},{"$f":"((X8-1)*$B$3)+Y8","v":7},6,4,null,null,{"$f":"W8","v":1},{"$f":"X8","v":2},{"$f":"Y8+1","v":4},{"$f":"((AF8-1)*$B$3)+AG8","v":8},8,5,null,null,null,null,null,null,null,null,null,null,null,null,null,null,null,null,null,null,"Aleksander RAIŠIČ",{"$f":"IF(AB6=FinishedMatchStates,1,0)+IF(AJ12=FinishedMatchStates,1,0)+IF(AB18=FinishedMatchStates,1,0)+IF(AB24=FinishedMatchStates,1,0)+IF(L30=FinishedMatchStates,1,0)+IF(T36=FinishedMatchStates,1,0)+IF(AB42=FinishedMatchStates,1,0)","v":5},{"$f":"AB5+AJ11+AB16+AB23+L28+T35+AB40","v":21},{"$f":"AB4+AJ10+AB17+AB22+L29+T34+AB41","v":14},7,{"$f":"IF(COUNTIF(WinStates,AC5),1,0)+IF(COUNTIF(WinStates,AK11),1,0)+IF(COUNTIF(WinStates,AC16),1,0)+IF(COUNTIF(WinStates,AC23),1,0)+IF(COUNTIF(WinStates,M28),1,0)+IF(COUNTIF(WinStates,U35),1,0)+IF(COUNTIF(WinStates,AC40),1,0)","v":4},{"$f":"8-IF(BH8>=BH5,1,0)-IF(BH8>=BH6,1,0)-IF(BH8>=BH7,1,0)-IF(BH8>=BH4,1,0)-IF(BH8>=BH9,1,0)-IF(BH8>=BH10,1,0)-IF(BH8>=BH11,1,0)","v":1},1,null,null,null,1,"Aleksander RAIŠIČ","",null,null,null,null,null,null,null,null,null,null,7,{"$f":"CB7","v":10},{"$f":"CC7+8","v":24},"$X$10",{"$f":"CONCATENATE($B$2)","v":"3"},7,"8","09:00:00",5,"","14:06:00","14:37:00","00:31:00","Miha ŽAGAR",2,5,"W","Iztok DOLINŠEK ",111,2,"L","F",true]
[20,"Iztok DOLINŠEK ",null,null,null,null,{"$f":"CELL(\"address\",OFFSET($A$5,K8,0))","v":"$A$6"},{"$f":"IF(AND(NOT(ISBLANK(I10)),I10<>UnsetMatchCompetitorText,I10<>AwaitingMatchCompetitorText,NOT(ISBLANK(I11)),I11<>UnsetMatchCompetitorText,I11<>AwaitingMatchCompetitorText),1,IF(AND(I10<>AwaitingMatchCompetitorText,I11<>AwaitingMatchCompetitorText),-1,0))","v":1},"09:00:00",null,null,null,null,null,{"$f":"CELL(\"address\",OFFSET($A$5,S8,0))","v":"$A$12"},{"$f":"IF(AND(NOT(ISBLANK(Q10)),Q10<>UnsetMatchCompetitorText,Q10<>AwaitingMatchCompetitorText,NOT(ISBLANK(Q11)),Q11<>UnsetMatchCompetitorText,Q11<>AwaitingMatchCompetitorText),1,IF(AND(Q10<>AwaitingMatchCompetitorText,Q11<>AwaitingMatchCompetitorText),-1,0))","v":1},"09:00:00",null,null,null,null,null,{"$f":"CELL(\"address\",OFFSET($A$5,AA8,0))","v":"$A$11"},{"$f":"IF(AND(NOT(ISBLANK(Y10)),Y10<>UnsetMatchCompetitorText,Y10<>AwaitingMatchCompetitorText,NOT(ISBLANK(Y11)),Y11<>UnsetMatchCompetitorText,Y11<>AwaitingMatchCompetitorText),1,IF(AND(Y10<>AwaitingMatchCompetitorText,Y11<>AwaitingMatchCompetitorText),-1,0))","v":1},"09:00:00",null,null,5,null,null,{"$f":"CELL(\"address\",OFFSET($A$5,AI8,0))","v":"$A$13"},{"$f":"IF(AND(NOT(ISBLANK(AG10)),AG10<>UnsetMatchCompetitorText,AG10<>AwaitingMatchCompetitorText,NOT(ISBLANK(AG11)),AG11<>UnsetMatchCompetitorText,AG11<>AwaitingMatchCompetitorText),1,IF(AND(AG10<>AwaitingMatchCompetitorText,AG11<>AwaitingMatchCompetitorText),-1,0))","v":1},"09:00:00",null,null,5,null,null,null,null,null,null,null,null,null,null,null,null,null,null,null,null,null,null,"Miha ŽAGAR",{"$f":"IF(T6=FinishedMatchStates,1,0)+IF(AB12=FinishedMatchStates,1,0)+IF(AB18=FinishedMatchStates,1,0)+IF(AJ24=FinishedMatchStates,1,0)+IF(AB30=FinishedMatchStates,1,0)+IF(L36=FinishedMatchStates,1,0)+IF(T42=FinishedMatchStates,1,0)","v":5},{"$f":"T5+AB10+AB17+AJ23+AB28+L35+T40","v":17},{"$f":"T4+AB11+AB16+AJ22+AB29+L34+T41","v":15},2,{"$f":"IF(COUNTIF(WinStates,U5),1,0)+IF(COUNTIF(WinStates,AC10),1,0)+IF(COUNTIF(WinStates,AC17),1,0)+IF(COUNTIF(WinStates,AK23),1,0)+IF(COUNTIF(WinStates,AC28),1,0)+IF(COUNTIF(WinStates,M35),1,0)+IF(COUNTIF(WinStates,U40),1,0)","v":3},{"$f":"8-IF(BH9>=BH5,1,0)-IF(BH9>=BH6,1,0)-IF(BH9>=BH7,1,0)-IF(BH9>=BH8,1,0)-IF(BH9>=BH4,1,0)-IF(BH9>=BH10,1,0)-IF(BH9>=BH11,1,0)","v":2},2,null,null,null,2,"Miha ŽAGAR","",null,null,null,null,null,null,null,null,null,null,8,{"$f":"CB8","v":10},{"$f":"CC8+8","v":32},"$AF$10",{"$f":"CONCATENATE($B$2)","v":"3"},8,"2","09:00:00",5,"","11:09:00","12:33:00","01:24:00","Jožef GATEJ",905,4,"L","Aleksander RAIŠIČ",220,5,"W","F",true]
[21,"Aleksander RAIŠIČ",null,null,null,null,"*",{"$f":"J8","v":5},{"$f":"IF(G10=\"*\",IF(AND(OFFSET(INDIRECT(G9),0,0)>0,NOT(ISNA(OFFSET(INDIRECT(G9),0,1)))),OFFSET(INDIRECT(G9),0,1),UnsetMatchCompetitorText),IF(OFFSET(INDIRECT(G9),2,5)>0,IF(COUNTIF(INDIRECT(G10),(OFFSET(INDIRECT(G9),0,5)))>0,OFFSET(INDIRECT(G9),0,1),IF(COUNTIF(INDIRECT(G10),(OFFSET(INDIRECT(G9),1,5)))>0,OFFSET(INDIRECT(G9),1,1),BlankMatchCompetitorText)),AwaitingMatchCompetitorText))","v":"Peter FIJAVŽ"},null,null,null,null,{"$f":"IF(M10=NormalWinState,AND(M11=NormalLoseState,L10>L11),TRUE)","v":true},"*",{"$f":"R8","v":6},{"$f":"IF(O10=\"*\",IF(AND(OFFSET(INDIRECT(O9),0,0)>0,NOT(ISNA(OFFSET(INDIRECT(O9),0,1)))),OFFSET(INDIRECT(O9),0,1),UnsetMatchCompetitorText),IF(OFFSET(INDIRECT(O9),2,5)>0,IF(COUNTIF(INDIRECT(O10),(OFFSET(INDIRECT(O9),0,5)))>0,OFFSET(INDIRECT(O9),0,1),IF(COUNTIF(INDIRECT(O10),(OFFSET(INDIRECT(O9),1,5)))>0,OFFSET(INDIRECT(O9),1,1),BlankMatchCompetitorText)),AwaitingMatchCompetitorText))","v":""},null,null,null,null,{"$f":"IF(U10=NormalWinState,AND(U11=NormalLoseState,T10>T11),TRUE)","v":true},"*",{"$f":"Z8","v":7},{"$f":"IF(W10=\"*\",IF(AND(OFFSET(INDIRECT(W9),0,0)>0,NOT(ISNA(OFFSET(INDIRECT(W9),0,1)))),OFFSET(INDIRECT(W9),0,1),UnsetMatchCompetitorText),IF(OFFSET(INDIRECT(W9),2,5)>0,IF(COUNTIF(INDIRECT(W10),(OFFSET(INDIRECT(W9),0,5)))>0,OFFSET(INDIRECT(W9),0,1),IF(COUNTIF(INDIRECT(W10),(OFFSET(INDIRECT(W9),1,5)))>0,OFFSET(INDIRECT(W9),1,1),BlankMatchCompetitorText)),AwaitingMatchCompetitorText))","v":"Miha ŽAGAR"},null,null,5,"W",{"$f":"IF(AC10=NormalWinState,AND(AC11=NormalLoseState,AB10>AB11),TRUE)","v":true},"*",{"$f":"AH8","v":8},{"$f":"IF(AE10=\"*\",IF(AND(OFFSET(INDIRECT(AE9),0,0)>0,NOT(ISNA(OFFSET(INDIRECT(AE9),0,1)))),OFFSET(INDIRECT(AE9),0,1),UnsetMatchCompetitorText),IF(OFFSET(INDIRECT(AE9),2,5)>0,IF(COUNTIF(INDIRECT(AE10),(OFFSET(INDIRECT(AE9),0,5)))>0,OFFSET(INDIRECT(AE9),0,1),IF(COUNTIF(INDIRECT(AE10),(OFFSET(INDIRECT(AE9),1,5)))>0,OFFSET(INDIRECT(AE9),1,1),BlankMatchCompetitorText)),AwaitingMatchCompetitorText))","v":"Jožef GATEJ"},null,null,4,"L",{"$f":"IF(AK10=NormalWinState,AND(AK11=NormalLoseState,AJ10>AJ11),TRUE)","v":true},null,null,null,null,null,null,null,null,null,null,null,null,null,null,null,null,"",{"$f":"IF(L6=FinishedMatchStates,1,0)+IF(T12=FinishedMatchStates,1,0)+IF(T18=FinishedMatchStates,1,0)+IF(AB24=FinishedMatchStates,1,0)+IF(AB30=FinishedMatchStates,1,0)+IF(AJ36=FinishedMatchStates,1,0)+IF(L42=FinishedMatchStates,1,0)","v":0},{"$f":"L5+T10+T17+AB22+AB29+AJ35+L40","v":0},{"$f":"L4+T11+T16+AB23+AB28+AJ34+L41","v":0},{"$f":"BE10-BF10","v":0},{"$f":"IF(COUNTIF(WinStates,M5),1,0)+IF(COUNTIF(WinStates,U10),1,0)+IF(COUNTIF(WinStates,U17),1,0)+IF(COUNTIF(WinStates,AC22),1,0)+IF(COUNTIF(WinStates,AC29),1,0)+IF(COUNTIF(WinStates,AK35),1,0)+IF(COUNTIF(WinStates,M40),1,0)","v":0},{"$f":"8-IF(BH10>=BH6,1,0)-IF(BH10>=BH7,1,0)-IF(BH10>=BH8,1,0)-IF(BH10>=BH9,1,0)-IF(BH10>=BH5,1,0)-IF(BH10>=BH11,1,0)-IF(BH10>=BH4,1,0)","v":7},null,null,null,null,0,"","",null,null,null,null,null,null,null,null,null,null,9,{"$f":"CB6+6","v":16},{"$f":"CC6","v":8},"$H$16","3",9,"2","09:00:00",5,"","13:25:00","14:00:00","00:35:00","Boštjan PEMIČ",678,0,"L","Peter FIJAVŽ",910,5,"W","F",true]
[22,"Miha ŽAGAR",null,null,null,null,{"$f":"CELL(\"address\",OFFSET($A$5,L8,0))","v":"$A$7"},null,{"$f":"IF(G12=\"*\",IF(AND(OFFSET(INDIRECT(G11),0,0)>0,NOT(ISNA(OFFSET(INDIRECT(G11),0,1)))),OFFSET(INDIRECT(G11),0,1),UnsetMatchCompetitorText),IF(OFFSET(INDIRECT(G11),2,5)>0,IF(COUNTIF(INDIRECT(G12),(OFFSET(INDIRECT(G11),0,5)))>0,OFFSET(INDIRECT(G11),0,1),IF(COUNTIF(INDIRECT(G12),(OFFSET(INDIRECT(G11),1,5)))>0,OFFSET(INDIRECT(G11),1,1),BlankMatchCompetitorText)),AwaitingMatchCompetitorText))","v":""},null,null,null,null,{"$f":"IF(M11=NormalWinState,AND(M10=NormalLoseState,L11>L10),TRUE)","v":true},{"$f":"CELL(\"address\",OFFSET($A$5,T8,0))","v":"$A$8"},null,{"$f":"IF(O12=\"*\",IF(AND(OFFSET(INDIRECT(O11),0,0)>0,NOT(ISNA(OFFSET(INDIRECT(O11),0,1)))),OFFSET(INDIRECT(O11),0,1),UnsetMatchCompetitorText),IF(OFFSET(INDIRECT(O11),2,5)>0,IF(COUNTIF(INDIRECT(O12),(OFFSET(INDIRECT(O11),0,5)))>0,OFFSET(INDIRECT(O11),0,1),IF(COUNTIF(INDIRECT(O12),(OFFSET(INDIRECT(O11),1,5)))>0,OFFSET(INDIRECT(O11),1,1),BlankMatchCompetitorText)),AwaitingMatchCompetitorText))","v":"Boštjan PEMIČ"},null,null,null,null,{"$f":"IF(U11=NormalWinState,AND(U10=NormalLoseState,T11>T10),TRUE)","v":true},{"$f":"CELL(\"address\",OFFSET($A$5,AB8,0))","v":"$A$9"},null,{"$f":"IF(W12=\"*\",IF(AND(OFFSET(INDIRECT(W11),0,0)>0,NOT(ISNA(OFFSET(INDIRECT(W11),0,1)))),OFFSET(INDIRECT(W11),0,1),UnsetMatchCompetitorText),IF(OFFSET(INDIRECT(W11),2,5)>0,IF(COUNTIF(INDIRECT(W12),(OFFSET(INDIRECT(W11),0,5)))>0,OFFSET(INDIRECT(W11),0,1),IF(COUNTIF(INDIRECT(W12),(OFFSET(INDIRECT(W11),1,5)))>0,OFFSET(INDIRECT(W11),1,1),BlankMatchCompetitorText)),AwaitingMatchCompetitorText))","v":"Iztok DOLINŠEK "},null,null,2,"L",{"$f":"IF(AC11=NormalWinState,AND(AC10=NormalLoseState,AB11>AB10),TRUE)","v":true},{"$f":"CELL(\"address\",OFFSET($A$5,AJ8,0))","v":"$A$10"},null,{"$f":"IF(AE12=\"*\",IF(AND(OFFSET(INDIRECT(AE11),0,0)>0,NOT(ISNA(OFFSET(INDIRECT(AE11),0,1)))),OFFSET(INDIRECT(AE11),0,1),UnsetMatchCompetitorText),IF(OFFSET(INDIRECT(AE11),2,5)>0,IF(COUNTIF(INDIRECT(AE12),(OFFSET(INDIRECT(AE11),0,5)))>0,OFFSET(INDIRECT(AE11),0,1),IF(COUNTIF(INDIRECT(AE12),(OFFSET(INDIRECT(AE11),1,5)))>0,OFFSET(INDIRECT(AE11),1,1),BlankMatchCompetitorText)),AwaitingMatchCompetitorText))","v":"Aleksander RAIŠIČ"},null,null,5,"W",{"$f":"IF(AK11=NormalWinState,AND(AK10=NormalLoseState,AJ11>AJ10),TRUE)","v":true},null,null,null,null,null,null,null,null,null,null,null,null,null,null,null,null,"Jožef GATEJ",{"$f":"IF(AJ6=FinishedMatchStates,1,0)+IF(AJ12=FinishedMatchStates,1,0)+IF(AJ18=FinishedMatchStates,1,0)+IF(AJ24=FinishedMatchStates,1,0)+IF(AJ30=FinishedMatchStates,1,0)+IF(AJ36=FinishedMatchStates,1,0)+IF(AJ42=FinishedMatchStates,1,0)","v":5},{"$f":"AJ5+AJ10+AJ17+AJ22+AJ29+AJ34+AJ41","v":18},{"$f":"AJ4+AJ11+AJ16+AJ23+AJ28+AJ35+AJ40","v":18},{"$f":"BE11-BF11","v":0},{"$f":"IF(COUNTIF(WinStates,AK5),1,0)+IF(COUNTIF(WinStates,AK10),1,0)+IF(COUNTIF(WinStates,AK17),1,0)+IF(COUNTIF(WinStates,AK22),1,0)+IF(COUNTIF(WinStates,AK29),1,0)+IF(COUNTIF(WinStates,AK34),1,0)+IF(COUNTIF(WinStates,AK41),1,0)","v":2},{"$f":"8-IF(BH11>=BH7,1,0)-IF(BH11>=BH8,1,0)-IF(BH11>=BH9,1,0)-IF(BH11>=BH10,1,0)-IF(BH11>=BH6,1,0)-IF(BH11>=BH4,1,0)-IF(BH11>=BH5,1,0)","v":4},null,null,null,null,0,"Jožef GATEJ","",null,null,null,null,null,null,null,null,null,null,10,{"$f":"CB10","v":16},{"$f":"CC10+8","v":16},"$P$16",{"$f":"CONCATENATE($B$2)","v":"3"},10,"","09:00:00",0,"","00:00:00","00:00:00","","Iztok DOLINŠEK ",111,0,0,"",0,0,0,0,false]
[23,"",null,null,null,null,"*",null,null,null,{"$f":"IF(ISBLANK(I12),\"\",IF(ISBLANK(J12),CurrentTime-I12,J12-I12))","v":""},null,{"$f":"IF(AND(COUNTIF(FinishedMatchStates,L12),NOT(ISNA(VLOOKUP(M10,MatchCompetitorStateCodes,1,FALSE))),NOT(ISNA(VLOOKUP(M11,MatchCompetitorStateCodes,1,FALSE))),COUNTIF(WinStates,M10)+COUNTIF(WinStates,M11)<=1,COUNTIF(LoseStates,M10)+COUNTIF(LoseStates,M11)<=1,IF(M10=NormalWinState,AND(M11=NormalLoseState,L10>L11),TRUE),IF(M11=NormalWinState,AND(M10=NormalLoseState,L11>L10),TRUE),NOT(ISBLANK(L9)),NOT(ISBLANK(I9)),NOT(ISBLANK(I12)),NOT(ISBLANK(J12)),H9>0),1,IF(COUNTIF(FinishedMatchStates,L12)>0,-1,0))","v":0},null,"*",null,null,null,{"$f":"IF(ISBLANK(Q12),\"\",IF(ISBLANK(R12),CurrentTime-Q12,R12-Q12))","v":""},null,{"$f":"IF(AND(COUNTIF(FinishedMatchStates,T12),NOT(ISNA(VLOOKUP(U10,MatchCompetitorStateCodes,1,FALSE))),NOT(ISNA(VLOOKUP(U11,MatchCompetitorStateCodes,1,FALSE))),COUNTIF(WinStates,U10)+COUNTIF(WinStates,U11)<=1,COUNTIF(LoseStates,U10)+COUNTIF(LoseStates,U11)<=1,IF(U10=NormalWinState,AND(U11=NormalLoseState,T10>T11),TRUE),IF(U11=NormalWinState,AND(U10=NormalLoseState,T11>T10),TRUE),NOT(ISBLANK(T9)),NOT(ISBLANK(Q9)),NOT(ISBLANK(Q12)),NOT(ISBLANK(R12)),P9>0),1,IF(COUNTIF(FinishedMatchStates,T12)>0,-1,0))","v":0},null,"*",8,"14:06:00","14:37:00",{"$f":"IF(ISBLANK(Y12),\"\",IF(ISBLANK(Z12),CurrentTime-Y12,Z12-Y12))","v":"00:31:00"},"F",{"$f":"IF(AND(COUNTIF(FinishedMatchStates,AB12),NOT(ISNA(VLOOKUP(AC10,MatchCompetitorStateCodes,1,FALSE))),NOT(ISNA(VLOOKUP(AC11,MatchCompetitorStateCodes,1,FALSE))),COUNTIF(WinStates,AC10)+COUNTIF(WinStates,AC11)<=1,COUNTIF(LoseStates,AC10)+COUNTIF(LoseStates,AC11)<=1,IF(AC10=NormalWinState,AND(AC11=NormalLoseState,AB10>AB11),TRUE),IF(AC11=NormalWinState,AND(AC10=NormalLoseState,AB11>AB10),TRUE),NOT(ISBLANK(AB9)),NOT(ISBLANK(Y9)),NOT(ISBLANK(Y12)),NOT(ISBLANK(Z12)),X9>0),1,IF(COUNTIF(FinishedMatchStates,AB12)>0,-1,0))","v":1},null,"*",2,"11:09:00","12:33:00",{"$f":"IF(ISBLANK(AG12),\"\",IF(ISBLANK(AH12),CurrentTime-AG12,AH12-AG12))","v":"01:24:00"},"F",{"$f":"IF(AND(COUNTIF(FinishedMatchStates,AJ12),NOT(ISNA(VLOOKUP(AK10,MatchCompetitorStateCodes,1,FALSE))),NOT(ISNA(VLOOKUP(AK11,MatchCompetitorStateCodes,1,FALSE))),COUNTIF(WinStates,AK10)+COUNTIF(WinStates,AK11)<=1,COUNTIF(LoseStates,AK10)+COUNTIF(LoseStates,AK11)<=1,IF(AK10=NormalWinState,AND(AK11=NormalLoseState,AJ10>AJ11),TRUE),IF(AK11=NormalWinState,AND(AK10=NormalLoseState,AJ11>AJ10),TRUE),NOT(ISBLANK(AJ9)),NOT(ISBLANK(AG9)),NOT(ISBLANK(AG12)),NOT(ISBLANK(AH12)),AF9>0),1,IF(COUNTIF(FinishedMatchStates,AJ12)>0,-1,0))","v":1},null,null,null,null,null,null,null,null,null,null,null,null,null,null,null,null,null,null,null,null,null,null,null,null,null,null,null,null,null,null,null,null,null,null,null,null,null,null,null,null,null,11,{"$f":"CB11","v":16},{"$f":"CC11+8","v":24},"$X$16",{"$f":"CONCATENATE($B$2)","v":"3"},11,"7","09:00:00",5,"","13:23:00","14:02:00","00:39:00","Aleksander RAIŠIČ",220,5,"W","Miha ŽAGAR",2,0,"L","F",true]
[24,"Jožef GATEJ",null,null,null,null,null,null,null,null,null,null,null,null,null,null,null,null,null,null,null,null,null,null,null,null,null,null,null,null,null,null,null,null,null,null,null,null,null,null,null,null,null,null,null,null,null,null,null,null,null,null,null,null,null,null,null,null,null,null,null,null,null,null,null,null,null,null,null,null,null,null,null,null,null,null,null,null,12,{"$f":"CB12","v":16},{"$f":"CC12+8","v":32},"$AF$16",{"$f":"CONCATENATE($B$2)","v":"3"},12,"","09:00:00",0,"","00:00:00","00:00:00","","",0,0,0,"Jožef GATEJ",905,0,0,0,false]
[null,null,null,null,null,null,{"$f":"G8","v":1},{"$f":"H8+1","v":3},{"$f":"I8","v":1},{"$f":"((H14-1)*$B$3)+I14","v":9},3,1,null,null,{"$f":"G14","v":1},{"$f":"H14","v":3},{"$f":"I14+1","v":2},{"$f":"((P14-1)*$B$3)+Q14","v":10},4,7,null,null,{"$f":"O14","v":1},{"$f":"P14","v":3},{"$f":"Q14+1","v":3},{"$f":"((X14-1)*$B$3)+Y14","v":11},5,6,null,null,{"$f":"W14","v":1},{"$f":"X14","v":3},{"$f":"Y14+1","v":4},{"$f":"((AF14-1)*$B$3)+AG14","v":12},2,8,null,null,null,null,null,null,null,null,null,null,null,null,null,null,null,null,null,null,null,null,null,null,null,null,null,null,null,null,null,null,null,null,null,null,null,null,null,null,null,null,null,null,13,{"$f":"CB10+6","v":22},{"$f":"CC10","v":8},"$H$22","3",13,"7","09:00:00",5,"","11:11:00","12:16:00","01:05:00","Peter FIJAVŽ",910,5,"W","Iztok DOLINŠEK ",111,2,"L","F",true]
["Uvr.","Tekmovalec","Poz.","L","S",null,{"$f":"CELL(\"address\",OFFSET($A$5,K14,0))","v":"$A$8"},{"$f":"IF(AND(NOT(ISBLANK(I16)),I16<>UnsetMatchCompetitorText,I16<>AwaitingMatchCompetitorText,NOT(ISBLANK(I17)),I17<>UnsetMatchCompetitorText,I17<>AwaitingMatchCompetitorText),1,IF(AND(I16<>AwaitingMatchCompetitorText,I17<>AwaitingMatchCompetitorText),-1,0))","v":1},"09:00:00",null,null,5,null,null,{"$f":"CELL(\"address\",OFFSET($A$5,S14,0))","v":"$A$9"},{"$f":"IF(AND(NOT(ISBLANK(Q16)),Q16<>UnsetMatchCompetitorText,Q16<>AwaitingMatchCompetitorText,NOT(ISBLANK(Q17)),Q17<>UnsetMatchCompetitorText,Q17<>AwaitingMatchCompetitorText),1,IF(AND(Q16<>AwaitingMatchCompetitorText,Q17<>AwaitingMatchCompetitorText),-1,0))","v":1},"09:00:00",null,null,null,null,null,{"$f":"CELL(\"address\",OFFSET($A$5,AA14,0))","v":"$A$10"},{"$f":"IF(AND(NOT(ISBLANK(Y16)),Y16<>UnsetMatchCompetitorText,Y16<>AwaitingMatchCompetitorText,NOT(ISBLANK(Y17)),Y17<>UnsetMatchCompetitorText,Y17<>AwaitingMatchCompetitorText),1,IF(AND(Y16<>AwaitingMatchCompetitorText,Y17<>AwaitingMatchCompetitorText),-1,0))","v":1},"09:00:00",null,null,5,null,null,{"$f":"CELL(\"address\",OFFSET($A$5,AI14,0))","v":"$A$7"},{"$f":"IF(AND(NOT(ISBLANK(AG16)),AG16<>UnsetMatchCompetitorText,AG16<>AwaitingMatchCompetitorText,NOT(ISBLANK(AG17)),AG17<>UnsetMatchCompetitorText,AG17<>AwaitingMatchCompetitorText),1,IF(AND(AG16<>AwaitingMatchCompetitorText,AG17<>AwaitingMatchCompetitorText),-1,0))","v":1},"09:00:00",null,null,null,null,null,null,null,null,null,null,null,null,null,null,null,null,null,null,null,null,null,null,null,null,null,null,null,null,null,null,null,null,null,null,null,null,null,null,null,null,null,null,null,null,null,14,{"$f":"CB14","v":22},{"$f":"CC14+8","v":16},"$P$22",{"$f":"CONCATENATE($B$2)","v":"3"},14,"","09:00:00",0,"","00:00:00","00:00:00","","",0,0,0,"Boštjan PEMIČ",678,0,0,0,false]
["Q",{"$f":"VLOOKUP(D16,BN$4:BP$11,2,)","v":"Aleksander RAIŠIČ"},{"$f":"VLOOKUP(D16,BN$4:BP$11,3,)","v":""},1,null,null,"*",{"$f":"J14","v":9},{"$f":"IF(G16=\"*\",IF(AND(OFFSET(INDIRECT(G15),0,0)>0,NOT(ISNA(OFFSET(INDIRECT(G15),0,1)))),OFFSET(INDIRECT(G15),0,1),UnsetMatchCompetitorText),IF(OFFSET(INDIRECT(G15),2,5)>0,IF(COUNTIF(INDIRECT(G16),(OFFSET(INDIRECT(G15),0,5)))>0,OFFSET(INDIRECT(G15),0,1),IF(COUNTIF(INDIRECT(G16),(OFFSET(INDIRECT(G15),1,5)))>0,OFFSET(INDIRECT(G15),1,1),BlankMatchCompetitorText)),AwaitingMatchCompetitorText))","v":"Boštjan PEMIČ"},null,null,0,"L",{"$f":"IF(M16=NormalWinState,AND(M17=NormalLoseState,L16>L17),TRUE)","v":true},"*",{"$f":"R14","v":10},{"$f":"IF(O16=\"*\",IF(AND(OFFSET(INDIRECT(O15),0,0)>0,NOT(ISNA(OFFSET(INDIRECT(O15),0,1)))),OFFSET(INDIRECT(O15),0,1),UnsetMatchCompetitorText),IF(OFFSET(INDIRECT(O15),2,5)>0,IF(COUNTIF(INDIRECT(O16),(OFFSET(INDIRECT(O15),0,5)))>0,OFFSET(INDIRECT(O15),0,1),IF(COUNTIF(INDIRECT(O16),(OFFSET(INDIRECT(O15),1,5)))>0,OFFSET(INDIRECT(O15),1,1),BlankMatchCompetitorText)),AwaitingMatchCompetitorText))","v":"Iztok DOLINŠEK "},null,null,null,null,{"$f":"IF(U16=NormalWinState,AND(U17=NormalLoseState,T16>T17),TRUE)","v":true},"*",{"$f":"Z14","v":11},{"$f":"IF(W16=\"*\",IF(AND(OFFSET(INDIRECT(W15),0,0)>0,NOT(ISNA(OFFSET(INDIRECT(W15),0,1)))),OFFSET(INDIRECT(W15),0,1),UnsetMatchCompetitorText),IF(OFFSET(INDIRECT(W15),2,5)>0,IF(COUNTIF(INDIRECT(W16),(OFFSET(INDIRECT(W15),0,5)))>0,OFFSET(INDIRECT(W15),0,1),IF(COUNTIF(INDIRECT(W16),(OFFSET(INDIRECT(W15),1,5)))>0,OFFSET(INDIRECT(W15),1,1),BlankMatchCompetitorText)),AwaitingMatchCompetitorText))","v":"Aleksander RAIŠIČ"},null,null,5,"W",{"$f":"IF(AC16=NormalWinState,AND(AC17=NormalLoseState,AB16>AB17),TRUE)","v":true},"*",{"$f":"AH14","v":12},{"$f":"IF(AE16=\"*\",IF(AND(OFFSET(INDIRECT(AE15),0,0)>0,NOT(ISNA(OFFSET(INDIRECT(AE15),0,1)))),OFFSET(INDIRECT(AE15),0,1),UnsetMatchCompetitorText),IF(OFFSET(INDIRECT(AE15),2,5)>0,IF(COUNTIF(INDIRECT(AE16),(OFFSET(INDIRECT(AE15),0,5)))>0,OFFSET(INDIRECT(AE15),0,1),IF(COUNTIF(INDIRECT(AE16),(OFFSET(INDIRECT(AE15),1,5)))>0,OFFSET(INDIRECT(AE15),1,1),BlankMatchCompetitorText)),AwaitingMatchCompetitorText))","v":""},null,null,null,null,{"$f":"IF(AK16=NormalWinState,AND(AK17=NormalLoseState,AJ16>AJ17),TRUE)","v":true},null,null,null,null,null,null,null,null,null,null,null,null,null,null,null,null,null,null,null,null,null,null,null,null,null,null,null,null,null,null,null,null,null,null,null,null,null,null,null,null,15,{"$f":"CB15","v":22},{"$f":"CC15+8","v":24},"$X$22",{"$f":"CONCATENATE($B$2)","v":"3"},15,"","09:00:00",0,"","00:00:00","00:00:00","","",0,0,0,"Aleksander RAIŠIČ",220,0,0,0,false]
["Q",{"$f":"VLOOKUP(D17,BN$4:BP$11,2,)","v":"Miha ŽAGAR"},{"$f":"VLOOKUP(D17,BN$4:BP$11,3,)","v":""},2,null,null,{"$f":"CELL(\"address\",OFFSET($A$5,L14,0))","v":"$A$6"},null,{"$f":"IF(G18=\"*\",IF(AND(OFFSET(INDIRECT(G17),0,0)>0,NOT(ISNA(OFFSET(INDIRECT(G17),0,1)))),OFFSET(INDIRECT(G17),0,1),UnsetMatchCompetitorText),IF(OFFSET(INDIRECT(G17),2,5)>0,IF(COUNTIF(INDIRECT(G18),(OFFSET(INDIRECT(G17),0,5)))>0,OFFSET(INDIRECT(G17),0,1),IF(COUNTIF(INDIRECT(G18),(OFFSET(INDIRECT(G17),1,5)))>0,OFFSET(INDIRECT(G17),1,1),BlankMatchCompetitorText)),AwaitingMatchCompetitorText))","v":"Peter FIJAVŽ"},null,null,5,"W",{"$f":"IF(M17=NormalWinState,AND(M16=NormalLoseState,L17>L16),TRUE)","v":true},{"$f":"CELL(\"address\",OFFSET($A$5,T14,0))","v":"$A$12"},null,{"$f":"IF(O18=\"*\",IF(AND(OFFSET(INDIRECT(O17),0,0)>0,NOT(ISNA(OFFSET(INDIRECT(O17),0,1)))),OFFSET(INDIRECT(O17),0,1),UnsetMatchCompetitorText),IF(OFFSET(INDIRECT(O17),2,5)>0,IF(COUNTIF(INDIRECT(O18),(OFFSET(INDIRECT(O17),0,5)))>0,OFFSET(INDIRECT(O17),0,1),IF(COUNTIF(INDIRECT(O18),(OFFSET(INDIRECT(O17),1,5)))>0,OFFSET(INDIRECT(O17),1,1),BlankMatchCompetitorText)),AwaitingMatchCompetitorText))","v":""},null,null,null,null,{"$f":"IF(U17=NormalWinState,AND(U16=NormalLoseState,T17>T16),TRUE)","v":true},{"$f":"CELL(\"address\",OFFSET($A$5,AB14,0))","v":"$A$11"},null,{"$f":"IF(W18=\"*\",IF(AND(OFFSET(INDIRECT(W17),0,0)>0,NOT(ISNA(OFFSET(INDIRECT(W17),0,1)))),OFFSET(INDIRECT(W17),0,1),UnsetMatchCompetitorText),IF(OFFSET(INDIRECT(W17),2,5)>0,IF(COUNTIF(INDIRECT(W18),(OFFSET(INDIRECT(W17),0,5)))>0,OFFSET(INDIRECT(W17),0,1),IF(COUNTIF(INDIRECT(W18),(OFFSET(INDIRECT(W17),1,5)))>0,OFFSET(INDIRECT(W17),1,1),BlankMatchCompetitorText)),AwaitingMatchCompetitorText))","v":"Miha ŽAGAR"},null,null,0,"L",{"$f":"IF(AC17=NormalWinState,AND(AC16=NormalLoseState,AB17>AB16),TRUE)","v":true},{"$f":"CELL(\"address\",OFFSET($A$5,AJ14,0))","v":"$A$13"},null,{"$f":"IF(AE18=\"*\",IF(AND(OFFSET(INDIRECT(AE17),0,0)>0,NOT(ISNA(OFFSET(INDIRECT(AE17),0,1)))),OFFSET(INDIRECT(AE17),0,1),UnsetMatchCompetitorText),IF(OFFSET(INDIRECT(AE17),2,5)>0,IF(COUNTIF(INDIRECT(AE18),(OFFSET(INDIRECT(AE17),0,5)))>0,OFFSET(INDIRECT(AE17),0,1),IF(COUNTIF(INDIRECT(AE18),(OFFSET(INDIRECT(AE17),1,5)))>0,OFFSET(INDIRECT(AE17),1,1),BlankMatchCompetitorText)),AwaitingMatchCompetitorText))","v":"Jožef GATEJ"},null,null,null,null,{"$f":"IF(AK17=NormalWinState,AND(AK16=NormalLoseState,AJ17>AJ16),TRUE)","v":true},null,null,null,null,null,null,null,null,null,null,null,null,null,null,null,null,null,null,null,null,null,null,null,null,null,null,null,null,null,null,null,null,null,null,null,null,null,null,null,null,16,{"$f":"CB16","v":22},{"$f":"CC16+8","v":32},"$AF$22",{"$f":"CONCATENATE($B$2)","v":"3"},16,"8","09:00:00",5,"","12:36:00","13:13:00","00:37:00","Jožef GATEJ",905,5,"W","Miha ŽAGAR",2,2,"L","F",true]
[{"$f":"A19-TournamentGroupCount","v":17},{"$error":"#N/A"},{"$error":"#N/A"},3,null,null,"*",2,"13:25:00","14:00:00",{"$f":"IF(ISBLANK(I18),\"\",IF(ISBLANK(J18),CurrentTime-I18,J18-I18))","v":"00:35:00"},"F",{"$f":"IF(AND(COUNTIF(FinishedMatchStates,L18),NOT(ISNA(VLOOKUP(M16,MatchCompetitorStateCodes,1,FALSE))),NOT(ISNA(VLOOKUP(M17,MatchCompetitorStateCodes,1,FALSE))),COUNTIF(WinStates,M16)+COUNTIF(WinStates,M17)<=1,COUNTIF(LoseStates,M16)+COUNTIF(LoseStates,M17)<=1,IF(M16=NormalWinState,AND(M17=NormalLoseState,L16>L17),TRUE),IF(M17=NormalWinState,AND(M16=NormalLoseState,L17>L16),TRUE),NOT(ISBLANK(L15)),NOT(ISBLANK(I15)),NOT(ISBLANK(I18)),NOT(ISBLANK(J18)),H15>0),1,IF(COUNTIF(FinishedMatchStates,L18)>0,-1,0))","v":1},null,"*",null,null,null,{"$f":"IF(ISBLANK(Q18),\"\",IF(ISBLANK(R18),CurrentTime-Q18,R18-Q18))","v":""},null,{"$f":"IF(AND(COUNTIF(FinishedMatchStates,T18),NOT(ISNA(VLOOKUP(U16,MatchCompetitorStateCodes,1,FALSE))),NOT(ISNA(VLOOKUP(U17,MatchCompetitorStateCodes,1,FALSE))),COUNTIF(WinStates,U16)+COUNTIF(WinStates,U17)<=1,COUNTIF(LoseStates,U16)+COUNTIF(LoseStates,U17)<=1,IF(U16=NormalWinState,AND(U17=NormalLoseState,T16>T17),TRUE),IF(U17=NormalWinState,AND(U16=NormalLoseState,T17>T16),TRUE),NOT(ISBLANK(T15)),NOT(ISBLANK(Q15)),NOT(ISBLANK(Q18)),NOT(ISBLANK(R18)),P15>0),1,IF(COUNTIF(FinishedMatchStates,T18)>0,-1,0))","v":0},null,"*",7,"13:23:00","14:02:00",{"$f":"IF(ISBLANK(Y18),\"\",IF(ISBLANK(Z18),CurrentTime-Y18,Z18-Y18))","v":"00:39:00"},"F",{"$f":"IF(AND(COUNTIF(FinishedMatchStates,AB18),NOT(ISNA(VLOOKUP(AC16,MatchCompetitorStateCodes,1,FALSE))),NOT(ISNA(VLOOKUP(AC17,MatchCompetitorStateCodes,1,FALSE))),COUNTIF(WinStates,AC16)+COUNTIF(WinStates,AC17)<=1,COUNTIF(LoseStates,AC16)+COUNTIF(LoseStates,AC17)<=1,IF(AC16=NormalWinState,AND(AC17=NormalLoseState,AB16>AB17),TRUE),IF(AC17=NormalWinState,AND(AC16=NormalLoseState,AB17>AB16),TRUE),NOT(ISBLANK(AB15)),NOT(ISBLANK(Y15)),NOT(ISBLANK(Y18)),NOT(ISBLANK(Z18)),X15>0),1,IF(COUNTIF(FinishedMatchStates,AB18)>0,-1,0))","v":1},null,"*",null,null,null,{"$f":"IF(ISBLANK(AG18),\"\",IF(ISBLANK(AH18),CurrentTime-AG18,AH18-AG18))","v":""},null,{"$f":"IF(AND(COUNTIF(FinishedMatchStates,AJ18),NOT(ISNA(VLOOKUP(AK16,MatchCompetitorStateCodes,1,FALSE))),NOT(ISNA(VLOOKUP(AK17,MatchCompetitorStateCodes,1,FALSE))),COUNTIF(WinStates,AK16)+COUNTIF(WinStates,AK17)<=1,COUNTIF(LoseStates,AK16)+COUNTIF(LoseStates,AK17)<=1,IF(AK16=NormalWinState,AND(AK17=NormalLoseState,AJ16>AJ17),TRUE),IF(AK17=NormalWinState,AND(AK16=NormalLoseState,AJ17>AJ16),TRUE),NOT(ISBLANK(AJ15)),NOT(ISBLANK(AG15)),NOT(ISBLANK(AG18)),NOT(ISBLANK(AH18)),AF15>0),1,IF(COUNTIF(FinishedMatchStates,AJ18)>0,-1,0))","v":0},null,null,null,null,null,null,null,null,null,null,null,null,null,null,null,null,null,null,null,null,null,null,null,null,null,null,null,null,null,null,null,null,null,null,null,null,null,null,null,null,null,17,{"$f":"CB14+6","v":28},{"$f":"CC14","v":8},"$H$28","3",17,"2","09:00:00",5,"","12:36:00","13:21:00","00:45:00","Aleksander RAIŠIČ",220,5,"W","Peter FIJAVŽ",910,1,"L","F",true]
[{"$f":"A20-TournamentGroupCount","v":21},{"$error":"#N/A"},{"$error":"#N/A"},4,null,null,null,null,null,null,null,null,null,null,null,null,null,null,null,null,null,null,null,null,null,null,null,null,null,null,null,null,null,null,null,null,null,null,null,null,null,null,null,null,null,null,null,null,null,null,null,null,null,null,null,null,null,null,null,null,null,null,null,null,null,null,null,null,null,null,null,null,null,null,null,null,null,null,18,{"$f":"CB18","v":28},{"$f":"CC18+8","v":16},"$P$28",{"$f":"CONCATENATE($B$2)","v":"3"},18,"","09:00:00",0,"","00:00:00","00:00:00","","Iztok DOLINŠEK ",111,0,0,"",0,0,0,0,false]
[{"$f":"A21-TournamentGroupCount","v":25},{"$error":"#N/A"},{"$error":"#N/A"},5,null,null,{"$f":"G14","v":1},{"$f":"H14+1","v":4},{"$f":"I14","v":1},{"$f":"((H20-1)*$B$3)+I20","v":13},1,4,null,null,{"$f":"G20","v":1},{"$f":"H20","v":4},{"$f":"I20+1","v":2},{"$f":"((P20-1)*$B$3)+Q20","v":14},2,3,null,null,{"$f":"O20","v":1},{"$f":"P20","v":4},{"$f":"Q20+1","v":3},{"$f":"((X20-1)*$B$3)+Y20","v":15},7,5,null,null,{"$f":"W20","v":1},{"$f":"X20","v":4},{"$f":"Y20+1","v":4},{"$f":"((AF20-1)*$B$3)+AG20","v":16},8,6,null,null,null,null,null,null,null,null,null,null,null,null,null,null,null,null,null,null,null,null,null,null,null,null,null,null,null,null,null,null,null,null,null,null,null,null,null,null,null,null,null,null,19,{"$f":"CB19","v":28},{"$f":"CC19+8","v":24},"$X$28",{"$f":"CONCATENATE($B$2)","v":"3"},19,"","09:00:00",0,"","00:00:00","00:00:00","","Miha ŽAGAR",2,0,0,"",0,0,0,0,false]
[{"$f":"A22-TournamentGroupCount","v":29},{"$error":"#N/A"},{"$error":"#N/A"},6,null,null,{"$f":"CELL(\"address\",OFFSET($A$5,K20,0))","v":"$A$6"},{"$f":"IF(AND(NOT(ISBLANK(I22)),I22<>UnsetMatchCompetitorText,I22<>AwaitingMatchCompetitorText,NOT(ISBLANK(I23)),I23<>UnsetMatchCompetitorText,I23<>AwaitingMatchCompetitorText),1,IF(AND(I22<>AwaitingMatchCompetitorText,I23<>AwaitingMatchCompetitorText),-1,0))","v":1},"09:00:00",null,null,5,null,null,{"$f":"CELL(\"address\",OFFSET($A$5,S20,0))","v":"$A$7"},{"$f":"IF(AND(NOT(ISBLANK(Q22)),Q22<>UnsetMatchCompetitorText,Q22<>AwaitingMatchCompetitorText,NOT(ISBLANK(Q23)),Q23<>UnsetMatchCompetitorText,Q23<>AwaitingMatchCompetitorText),1,IF(AND(Q22<>AwaitingMatchCompetitorText,Q23<>AwaitingMatchCompetitorText),-1,0))","v":1},"09:00:00",null,null,null,null,null,{"$f":"CELL(\"address\",OFFSET($A$5,AA20,0))","v":"$A$12"},{"$f":"IF(AND(NOT(ISBLANK(Y22)),Y22<>UnsetMatchCompetitorText,Y22<>AwaitingMatchCompetitorText,NOT(ISBLANK(Y23)),Y23<>UnsetMatchCompetitorText,Y23<>AwaitingMatchCompetitorText),1,IF(AND(Y22<>AwaitingMatchCompetitorText,Y23<>AwaitingMatchCompetitorText),-1,0))","v":1},"09:00:00",null,null,null,null,null,{"$f":"CELL(\"address\",OFFSET($A$5,AI20,0))","v":"$A$13"},{"$f":"IF(AND(NOT(ISBLANK(AG22)),AG22<>UnsetMatchCompetitorText,AG22<>AwaitingMatchCompetitorText,NOT(ISBLANK(AG23)),AG23<>UnsetMatchCompetitorText,AG23<>AwaitingMatchCompetitorText),1,IF(AND(AG22<>AwaitingMatchCompetitorText,AG23<>AwaitingMatchCompetitorText),-1,0))","v":1},"09:00:00",null,null,5,null,null,null,null,null,null,null,null,null,null,null,null,null,null,null,null,null,null,null,null,null,null,null,null,null,null,null,null,null,null,null,null,null,null,null,null,null,null,null,null,null,null,20,{"$f":"CB20","v":28},{"$f":"CC20+8","v":32},"$AF$28",{"$f":"CONCATENATE($B$2)","v":"3"},20,"7","09:00:00",5,"","14:44:00","15:23:00","00:39:00","Boštjan PEMIČ",678,1,"L","Jožef GATEJ",905,5,"W","F",true]
[{"$f":"A23-TournamentGroupCount","v":33},{"$error":"#N/A"},{"$error":"#N/A"},7,null,null,"*",{"$f":"J20","v":13},{"$f":"IF(G22=\"*\",IF(AND(OFFSET(INDIRECT(G21),0,0)>0,NOT(ISNA(OFFSET(INDIRECT(G21),0,1)))),OFFSET(INDIRECT(G21),0,1),UnsetMatchCompetitorText),IF(OFFSET(INDIRECT(G21),2,5)>0,IF(COUNTIF(INDIRECT(G22),(OFFSET(INDIRECT(G21),0,5)))>0,OFFSET(INDIRECT(G21),0,1),IF(COUNTIF(INDIRECT(G22),(OFFSET(INDIRECT(G21),1,5)))>0,OFFSET(INDIRECT(G21),1,1),BlankMatchCompetitorText)),AwaitingMatchCompetitorText))","v":"Peter FIJAVŽ"},null,null,5,"W",{"$f":"IF(M22=NormalWinState,AND(M23=NormalLoseState,L22>L23),TRUE)","v":true},"*",{"$f":"R20","v":14},{"$f":"IF(O22=\"*\",IF(AND(OFFSET(INDIRECT(O21),0,0)>0,NOT(ISNA(OFFSET(INDIRECT(O21),0,1)))),OFFSET(INDIRECT(O21),0,1),UnsetMatchCompetitorText),IF(OFFSET(INDIRECT(O21),2,5)>0,IF(COUNTIF(INDIRECT(O22),(OFFSET(INDIRECT(O21),0,5)))>0,OFFSET(INDIRECT(O21),0,1),IF(COUNTIF(INDIRECT(O22),(OFFSET(INDIRECT(O21),1,5)))>0,OFFSET(INDIRECT(O21),1,1),BlankMatchCompetitorText)),AwaitingMatchCompetitorText))","v":""},null,null,null,null,{"$f":"IF(U22=NormalWinState,AND(U23=NormalLoseState,T22>T23),TRUE)","v":true},"*",{"$f":"Z20","v":15},{"$f":"IF(W22=\"*\",IF(AND(OFFSET(INDIRECT(W21),0,0)>0,NOT(ISNA(OFFSET(INDIRECT(W21),0,1)))),OFFSET(INDIRECT(W21),0,1),UnsetMatchCompetitorText),IF(OFFSET(INDIRECT(W21),2,5)>0,IF(COUNTIF(INDIRECT(W22),(OFFSET(INDIRECT(W21),0,5)))>0,OFFSET(INDIRECT(W21),0,1),IF(COUNTIF(INDIRECT(W22),(OFFSET(INDIRECT(W21),1,5)))>0,OFFSET(INDIRECT(W21),1,1),BlankMatchCompetitorText)),AwaitingMatchCompetitorText))","v":""},null,null,null,null,{"$f":"IF(AC22=NormalWinState,AND(AC23=NormalLoseState,AB22>AB23),TRUE)","v":true},"*",{"$f":"AH20","v":16},{"$f":"IF(AE22=\"*\",IF(AND(OFFSET(INDIRECT(AE21),0,0)>0,NOT(ISNA(OFFSET(INDIRECT(AE21),0,1)))),OFFSET(INDIRECT(AE21),0,1),UnsetMatchCompetitorText),IF(OFFSET(INDIRECT(AE21),2,5)>0,IF(COUNTIF(INDIRECT(AE22),(OFFSET(INDIRECT(AE21),0,5)))>0,OFFSET(INDIRECT(AE21),0,1),IF(COUNTIF(INDIRECT(AE22),(OFFSET(INDIRECT(AE21),1,5)))>0,OFFSET(INDIRECT(AE21),1,1),BlankMatchCompetitorText)),AwaitingMatchCompetitorText))","v":"Jožef GATEJ"},null,null,5,"W",{"$f":"IF(AK22=NormalWinState,AND(AK23=NormalLoseState,AJ22>AJ23),TRUE)","v":true},null,null,null,null,null,null,null,null,null,null,null,null,null,null,null,null,null,null,null,null,null,null,null,null,null,null,null,null,null,null,null,null,null,null,null,null,null,null,null,null,21,{"$f":"CB18+6","v":34},{"$f":"CC18","v":8},"$H$34","3",21,"5","09:00:00",5,"","09:58:00","10:49:00","00:51:00","Peter FIJAVŽ",910,1,"L","Miha ŽAGAR",2,5,"W","F",true]
[{"$f":"TournamentSize-TournamentGroupCount+1","v":37},{"$error":"#N/A"},{"$error":"#N/A"},8,null,null,{"$f":"CELL(\"address\",OFFSET($A$5,L20,0))","v":"$A$9"},null,{"$f":"IF(G24=\"*\",IF(AND(OFFSET(INDIRECT(G23),0,0)>0,NOT(ISNA(OFFSET(INDIRECT(G23),0,1)))),OFFSET(INDIRECT(G23),0,1),UnsetMatchCompetitorText),IF(OFFSET(INDIRECT(G23),2,5)>0,IF(COUNTIF(INDIRECT(G24),(OFFSET(INDIRECT(G23),0,5)))>0,OFFSET(INDIRECT(G23),0,1),IF(COUNTIF(INDIRECT(G24),(OFFSET(INDIRECT(G23),1,5)))>0,OFFSET(INDIRECT(G23),1,1),BlankMatchCompetitorText)),AwaitingMatchCompetitorText))","v":"Iztok DOLINŠEK "},null,null,2,"L",{"$f":"IF(M23=NormalWinState,AND(M22=NormalLoseState,L23>L22),TRUE)","v":true},{"$f":"CELL(\"address\",OFFSET($A$5,T20,0))","v":"$A$8"},null,{"$f":"IF(O24=\"*\",IF(AND(OFFSET(INDIRECT(O23),0,0)>0,NOT(ISNA(OFFSET(INDIRECT(O23),0,1)))),OFFSET(INDIRECT(O23),0,1),UnsetMatchCompetitorText),IF(OFFSET(INDIRECT(O23),2,5)>0,IF(COUNTIF(INDIRECT(O24),(OFFSET(INDIRECT(O23),0,5)))>0,OFFSET(INDIRECT(O23),0,1),IF(COUNTIF(INDIRECT(O24),(OFFSET(INDIRECT(O23),1,5)))>0,OFFSET(INDIRECT(O23),1,1),BlankMatchCompetitorText)),AwaitingMatchCompetitorText))","v":"Boštjan PEMIČ"},null,null,null,null,{"$f":"IF(U23=NormalWinState,AND(U22=NormalLoseState,T23>T22),TRUE)","v":true},{"$f":"CELL(\"address\",OFFSET($A$5,AB20,0))","v":"$A$10"},null,{"$f":"IF(W24=\"*\",IF(AND(OFFSET(INDIRECT(W23),0,0)>0,NOT(ISNA(OFFSET(INDIRECT(W23),0,1)))),OFFSET(INDIRECT(W23),0,1),UnsetMatchCompetitorText),IF(OFFSET(INDIRECT(W23),2,5)>0,IF(COUNTIF(INDIRECT(W24),(OFFSET(INDIRECT(W23),0,5)))>0,OFFSET(INDIRECT(W23),0,1),IF(COUNTIF(INDIRECT(W24),(OFFSET(INDIRECT(W23),1,5)))>0,OFFSET(INDIRECT(W23),1,1),BlankMatchCompetitorText)),AwaitingMatchCompetitorText))","v":"Aleksander RAIŠIČ"},null,null,null,null,{"$f":"IF(AC23=NormalWinState,AND(AC22=NormalLoseState,AB23>AB22),TRUE)","v":true},{"$f":"CELL(\"address\",OFFSET($A$5,AJ20,0))","v":"$A$11"},null,{"$f":"IF(AE24=\"*\",IF(AND(OFFSET(INDIRECT(AE23),0,0)>0,NOT(ISNA(OFFSET(INDIRECT(AE23),0,1)))),OFFSET(INDIRECT(AE23),0,1),UnsetMatchCompetitorText),IF(OFFSET(INDIRECT(AE23),2,5)>0,IF(COUNTIF(INDIRECT(AE24),(OFFSET(INDIRECT(AE23),0,5)))>0,OFFSET(INDIRECT(AE23),0,1),IF(COUNTIF(INDIRECT(AE24),(OFFSET(INDIRECT(AE23),1,5)))>0,OFFSET(INDIRECT(AE23),1,1),BlankMatchCompetitorText)),AwaitingMatchCompetitorText))","v":"Miha ŽAGAR"},null,null,2,"L",{"$f":"IF(AK23=NormalWinState,AND(AK22=NormalLoseState,AJ23>AJ22),TRUE)","v":true},null,null,null,null,null,null,null,null,null,null,null,null,null,null,null,null,null,null,null,null,null,null,null,null,null,null,null,null,null,null,null,null,null,null,null,null,null,null,null,null,22,{"$f":"CB22","v":34},{"$f":"CC22+8","v":16},"$P$34",{"$f":"CONCATENATE($B$2)","v":"3"},22,"","09:00:00",0,"","00:00:00","00:00:00","","",0,0,0,"Aleksander RAIŠIČ",220,0,0,0,false]
[null,null,null,null,null,null,"*",7,"11:11:00","12:16:00",{"$f":"IF(ISBLANK(I24),\"\",IF(ISBLANK(J24),CurrentTime-I24,J24-I24))","v":"01:05:00"},"F",{"$f":"IF(AND(COUNTIF(FinishedMatchStates,L24),NOT(ISNA(VLOOKUP(M22,MatchCompetitorStateCodes,1,FALSE))),NOT(ISNA(VLOOKUP(M23,MatchCompetitorStateCodes,1,FALSE))),COUNTIF(WinStates,M22)+COUNTIF(WinStates,M23)<=1,COUNTIF(LoseStates,M22)+COUNTIF(LoseStates,M23)<=1,IF(M22=NormalWinState,AND(M23=NormalLoseState,L22>L23),TRUE),IF(M23=NormalWinState,AND(M22=NormalLoseState,L23>L22),TRUE),NOT(ISBLANK(L21)),NOT(ISBLANK(I21)),NOT(ISBLANK(I24)),NOT(ISBLANK(J24)),H21>0),1,IF(COUNTIF(FinishedMatchStates,L24)>0,-1,0))","v":1},null,"*",null,null,null,{"$f":"IF(ISBLANK(Q24),\"\",IF(ISBLANK(R24),CurrentTime-Q24,R24-Q24))","v":""},null,{"$f":"IF(AND(COUNTIF(FinishedMatchStates,T24),NOT(ISNA(VLOOKUP(U22,MatchCompetitorStateCodes,1,FALSE))),NOT(ISNA(VLOOKUP(U23,MatchCompetitorStateCodes,1,FALSE))),COUNTIF(WinStates,U22)+COUNTIF(WinStates,U23)<=1,COUNTIF(LoseStates,U22)+COUNTIF(LoseStates,U23)<=1,IF(U22=NormalWinState,AND(U23=NormalLoseState,T22>T23),TRUE),IF(U23=NormalWinState,AND(U22=NormalLoseState,T23>T22),TRUE),NOT(ISBLANK(T21)),NOT(ISBLANK(Q21)),NOT(ISBLANK(Q24)),NOT(ISBLANK(R24)),P21>0),1,IF(COUNTIF(FinishedMatchStates,T24)>0,-1,0))","v":0},null,"*",null,null,null,{"$f":"IF(ISBLANK(Y24),\"\",IF(ISBLANK(Z24),CurrentTime-Y24,Z24-Y24))","v":""},null,{"$f":"IF(AND(COUNTIF(FinishedMatchStates,AB24),NOT(ISNA(VLOOKUP(AC22,MatchCompetitorStateCodes,1,FALSE))),NOT(ISNA(VLOOKUP(AC23,MatchCompetitorStateCodes,1,FALSE))),COUNTIF(WinStates,AC22)+COUNTIF(WinStates,AC23)<=1,COUNTIF(LoseStates,AC22)+COUNTIF(LoseStates,AC23)<=1,IF(AC22=NormalWinState,AND(AC23=NormalLoseState,AB22>AB23),TRUE),IF(AC23=NormalWinState,AND(AC22=NormalLoseState,AB23>AB22),TRUE),NOT(ISBLANK(AB21)),NOT(ISBLANK(Y21)),NOT(ISBLANK(Y24)),NOT(ISBLANK(Z24)),X21>0),1,IF(COUNTIF(FinishedMatchStates,AB24)>0,-1,0))","v":0},null,"*",8,"12:36:00","13:13:00",{"$f":"IF(ISBLANK(AG24),\"\",IF(ISBLANK(AH24),CurrentTime-AG24,AH24-AG24))","v":"00:37:00"},"F",{"$f":"IF(AND(COUNTIF(FinishedMatchStates,AJ24),NOT(ISNA(VLOOKUP(AK22,MatchCompetitorStateCodes,1,FALSE))),NOT(ISNA(VLOOKUP(AK23,MatchCompetitorStateCodes,1,FALSE))),COUNTIF(WinStates,AK22)+COUNTIF(WinStates,AK23)<=1,COUNTIF(LoseStates,AK22)+COUNTIF(LoseStates,AK23)<=1,IF(AK22=NormalWinState,AND(AK23=NormalLoseState,AJ22>AJ23),TRUE),IF(AK23=NormalWinState,AND(AK22=NormalLoseState,AJ23>AJ22),TRUE),NOT(ISBLANK(AJ21)),NOT(ISBLANK(AG21)),NOT(ISBLANK(AG24)),NOT(ISBLANK(AH24)),AF21>0),1,IF(COUNTIF(FinishedMatchStates,AJ24)>0,-1,0))","v":1},null,null,null,null,null,null,null,null,null,null,null,null,null,null,null,null,null,null,null,null,null,null,null,null,null,null,null,null,null,null,null,null,null,null,null,null,null,null,null,null,null,23,{"$f":"CB23","v":34},{"$f":"CC23+8","v":24},"$X$34",{"$f":"CONCATENATE($B$2)","v":"3"},23,"7","09:00:00",5,"","12:17:00","13:06:00","00:49:00","Boštjan PEMIČ",678,4,"L","Iztok DOLINŠEK ",111,5,"W","F",true]
[null,null,null,null,null,null,null,null,null,null,null,null,null,null,null,null,null,null,null,null,null,null,null,null,null,null,null,null,null,null,null,null,null,null,null,null,null,null,null,null,null,null,null,null,null,null,null,null,null,null,null,null,null,null,null,null,null,null,null,null,null,null,null,null,null,null,null,null,null,null,null,null,null,null,null,null,null,null,24,{"$f":"CB24","v":34},{"$f":"CC24+8","v":32},"$AF$34",{"$f":"CONCATENATE($B$2)","v":"3"},24,"","09:00:00",0,"","00:00:00","00:00:00","","Jožef GATEJ",905,0,0,"",0,0,0,0,false]
[null,null,null,null,null,null,{"$f":"G20","v":1},{"$f":"H20+1","v":5},{"$f":"I20","v":1},{"$f":"((H26-1)*$B$3)+I26","v":17},5,1,null,null,{"$f":"G26","v":1},{"$f":"H26","v":5},{"$f":"I26+1","v":2},{"$f":"((P26-1)*$B$3)+Q26","v":18},4,2,null,null,{"$f":"O26","v":1},{"$f":"P26","v":5},{"$f":"Q26+1","v":3},{"$f":"((X26-1)*$B$3)+Y26","v":19},6,7,null,null,{"$f":"W26","v":1},{"$f":"X26","v":5},{"$f":"Y26+1","v":4},{"$f":"((AF26-1)*$B$3)+AG26","v":20},3,8,null,null,null,null,null,null,null,null,null,null,null,null,null,null,null,null,null,null,null,null,null,null,null,null,null,null,null,null,null,null,null,null,null,null,null,null,null,null,null,null,null,null,25,{"$f":"CB22+6","v":40},{"$f":"CC22","v":8},"$H$40","3",25,"","09:00:00",0,"","00:00:00","00:00:00","","",0,0,0,"Peter FIJAVŽ",910,0,0,0,false]
[null,null,null,null,null,null,{"$f":"CELL(\"address\",OFFSET($A$5,K26,0))","v":"$A$10"},{"$f":"IF(AND(NOT(ISBLANK(I28)),I28<>UnsetMatchCompetitorText,I28<>AwaitingMatchCompetitorText,NOT(ISBLANK(I29)),I29<>UnsetMatchCompetitorText,I29<>AwaitingMatchCompetitorText),1,IF(AND(I28<>AwaitingMatchCompetitorText,I29<>AwaitingMatchCompetitorText),-1,0))","v":1},"09:00:00",null,null,5,null,null,{"$f":"CELL(\"address\",OFFSET($A$5,S26,0))","v":"$A$9"},{"$f":"IF(AND(NOT(ISBLANK(Q28)),Q28<>UnsetMatchCompetitorText,Q28<>AwaitingMatchCompetitorText,NOT(ISBLANK(Q29)),Q29<>UnsetMatchCompetitorText,Q29<>AwaitingMatchCompetitorText),1,IF(AND(Q28<>AwaitingMatchCompetitorText,Q29<>AwaitingMatchCompetitorText),-1,0))","v":1},"09:00:00",null,null,null,null,null,{"$f":"CELL(\"address\",OFFSET($A$5,AA26,0))","v":"$A$11"},{"$f":"IF(AND(NOT(ISBLANK(Y28)),Y28<>UnsetMatchCompetitorText,Y28<>AwaitingMatchCompetitorText,NOT(ISBLANK(Y29)),Y29<>UnsetMatchCompetitorText,Y29<>AwaitingMatchCompetitorText),1,IF(AND(Y28<>AwaitingMatchCompetitorText,Y29<>AwaitingMatchCompetitorText),-1,0))","v":1},"09:00:00",null,null,null,null,null,{"$f":"CELL(\"address\",OFFSET($A$5,AI26,0))","v":"$A$8"},{"$f":"IF(AND(NOT(ISBLANK(AG28)),AG28<>UnsetMatchCompetitorText,AG28<>AwaitingMatchCompetitorText,NOT(ISBLANK(AG29)),AG29<>UnsetMatchCompetitorText,AG29<>AwaitingMatchCompetitorText),1,IF(AND(AG28<>AwaitingMatchCompetitorText,AG29<>AwaitingMatchCompetitorText),-1,0))","v":1},"09:00:00",null,null,5,null,null,null,null,null,null,null,null,null,null,null,null,null,null,null,null,null,null,null,null,null,null,null,null,null,null,null,null,null,null,null,null,null,null,null,null,null,null,null,null,null,null,26,{"$f":"CB26","v":40},{"$f":"CC26+8","v":16},"$P$40",{"$f":"CONCATENATE($B$2)","v":"3"},26,"","09:00:00",0,"","00:00:00","00:00:00","","Miha ŽAGAR",2,0,0,"",0,0,0,0,false]
[null,null,null,null,null,null,"*",{"$f":"J26","v":17},{"$f":"IF(G28=\"*\",IF(AND(OFFSET(INDIRECT(G27),0,0)>0,NOT(ISNA(OFFSET(INDIRECT(G27),0,1)))),OFFSET(INDIRECT(G27),0,1),UnsetMatchCompetitorText),IF(OFFSET(INDIRECT(G27),2,5)>0,IF(COUNTIF(INDIRECT(G28),(OFFSET(INDIRECT(G27),0,5)))>0,OFFSET(INDIRECT(G27),0,1),IF(COUNTIF(INDIRECT(G28),(OFFSET(INDIRECT(G27),1,5)))>0,OFFSET(INDIRECT(G27),1,1),BlankMatchCompetitorText)),AwaitingMatchCompetitorText))","v":"Aleksander RAIŠIČ"},null,null,5,"W",{"$f":"IF(M28=NormalWinState,AND(M29=NormalLoseState,L28>L29),TRUE)","v":true},"*",{"$f":"R26","v":18},{"$f":"IF(O28=\"*\",IF(AND(OFFSET(INDIRECT(O27),0,0)>0,NOT(ISNA(OFFSET(INDIRECT(O27),0,1)))),OFFSET(INDIRECT(O27),0,1),UnsetMatchCompetitorText),IF(OFFSET(INDIRECT(O27),2,5)>0,IF(COUNTIF(INDIRECT(O28),(OFFSET(INDIRECT(O27),0,5)))>0,OFFSET(INDIRECT(O27),0,1),IF(COUNTIF(INDIRECT(O28),(OFFSET(INDIRECT(O27),1,5)))>0,OFFSET(INDIRECT(O27),1,1),BlankMatchCompetitorText)),AwaitingMatchCompetitorText))","v":"Iztok DOLINŠEK "},null,null,null,null,{"$f":"IF(U28=NormalWinState,AND(U29=NormalLoseState,T28>T29),TRUE)","v":true},"*",{"$f":"Z26","v":19},{"$f":"IF(W28=\"*\",IF(AND(OFFSET(INDIRECT(W27),0,0)>0,NOT(ISNA(OFFSET(INDIRECT(W27),0,1)))),OFFSET(INDIRECT(W27),0,1),UnsetMatchCompetitorText),IF(OFFSET(INDIRECT(W27),2,5)>0,IF(COUNTIF(INDIRECT(W28),(OFFSET(INDIRECT(W27),0,5)))>0,OFFSET(INDIRECT(W27),0,1),IF(COUNTIF(INDIRECT(W28),(OFFSET(INDIRECT(W27),1,5)))>0,OFFSET(INDIRECT(W27),1,1),BlankMatchCompetitorText)),AwaitingMatchCompetitorText))","v":"Miha ŽAGAR"},null,null,null,null,{"$f":"IF(AC28=NormalWinState,AND(AC29=NormalLoseState,AB28>AB29),TRUE)","v":true},"*",{"$f":"AH26","v":20},{"$f":"IF(AE28=\"*\",IF(AND(OFFSET(INDIRECT(AE27),0,0)>0,NOT(ISNA(OFFSET(INDIRECT(AE27),0,1)))),OFFSET(INDIRECT(AE27),0,1),UnsetMatchCompetitorText),IF(OFFSET(INDIRECT(AE27),2,5)>0,IF(COUNTIF(INDIRECT(AE28),(OFFSET(INDIRECT(AE27),0,5)))>0,OFFSET(INDIRECT(AE27),0,1),IF(COUNTIF(INDIRECT(AE28),(OFFSET(INDIRECT(AE27),1,5)))>0,OFFSET(INDIRECT(AE27),1,1),BlankMatchCompetitorText)),AwaitingMatchCompetitorText))","v":"Boštjan PEMIČ"},null,null,1,"L",{"$f":"IF(AK28=NormalWinState,AND(AK29=NormalLoseState,AJ28>AJ29),TRUE)","v":true},null,null,null,null,null,null,null,null,null,null,null,null,null,null,null,null,null,null,null,null,null,null,null,null,null,null,null,null,null,null,null,null,null,null,null,null,null,null,null,null,27,{"$f":"CB27","v":40},{"$f":"CC27+8","v":24},"$X$40",{"$f":"CONCATENATE($B$2)","v":"3"},27,"7","09:00:00",5,"","14:04:00","14:43:00","00:39:00","Aleksander RAIŠIČ",220,1,"L","Boštjan PEMIČ",678,5,"W","F",true]
[null,null,null,null,null,null,{"$f":"CELL(\"address\",OFFSET($A$5,L26,0))","v":"$A$6"},null,{"$f":"IF(G30=\"*\",IF(AND(OFFSET(INDIRECT(G29),0,0)>0,NOT(ISNA(OFFSET(INDIRECT(G29),0,1)))),OFFSET(INDIRECT(G29),0,1),UnsetMatchCompetitorText),IF(OFFSET(INDIRECT(G29),2,5)>0,IF(COUNTIF(INDIRECT(G30),(OFFSET(INDIRECT(G29),0,5)))>0,OFFSET(INDIRECT(G29),0,1),IF(COUNTIF(INDIRECT(G30),(OFFSET(INDIRECT(G29),1,5)))>0,OFFSET(INDIRECT(G29),1,1),BlankMatchCompetitorText)),AwaitingMatchCompetitorText))","v":"Peter FIJAVŽ"},null,null,1,"L",{"$f":"IF(M29=NormalWinState,AND(M28=NormalLoseState,L29>L28),TRUE)","v":true},{"$f":"CELL(\"address\",OFFSET($A$5,T26,0))","v":"$A$7"},null,{"$f":"IF(O30=\"*\",IF(AND(OFFSET(INDIRECT(O29),0,0)>0,NOT(ISNA(OFFSET(INDIRECT(O29),0,1)))),OFFSET(INDIRECT(O29),0,1),UnsetMatchCompetitorText),IF(OFFSET(INDIRECT(O29),2,5)>0,IF(COUNTIF(INDIRECT(O30),(OFFSET(INDIRECT(O29),0,5)))>0,OFFSET(INDIRECT(O29),0,1),IF(COUNTIF(INDIRECT(O30),(OFFSET(INDIRECT(O29),1,5)))>0,OFFSET(INDIRECT(O29),1,1),BlankMatchCompetitorText)),AwaitingMatchCompetitorText))","v":""},null,null,null,null,{"$f":"IF(U29=NormalWinState,AND(U28=NormalLoseState,T29>T28),TRUE)","v":true},{"$f":"CELL(\"address\",OFFSET($A$5,AB26,0))","v":"$A$12"},null,{"$f":"IF(W30=\"*\",IF(AND(OFFSET(INDIRECT(W29),0,0)>0,NOT(ISNA(OFFSET(INDIRECT(W29),0,1)))),OFFSET(INDIRECT(W29),0,1),UnsetMatchCompetitorText),IF(OFFSET(INDIRECT(W29),2,5)>0,IF(COUNTIF(INDIRECT(W30),(OFFSET(INDIRECT(W29),0,5)))>0,OFFSET(INDIRECT(W29),0,1),IF(COUNTIF(INDIRECT(W30),(OFFSET(INDIRECT(W29),1,5)))>0,OFFSET(INDIRECT(W29),1,1),BlankMatchCompetitorText)),AwaitingMatchCompetitorText))","v":""},null,null,null,null,{"$f":"IF(AC29=NormalWinState,AND(AC28=NormalLoseState,AB29>AB28),TRUE)","v":true},{"$f":"CELL(\"address\",OFFSET($A$5,AJ26,0))","v":"$A$13"},null,{"$f":"IF(AE30=\"*\",IF(AND(OFFSET(INDIRECT(AE29),0,0)>0,NOT(ISNA(OFFSET(INDIRECT(AE29),0,1)))),OFFSET(INDIRECT(AE29),0,1),UnsetMatchCompetitorText),IF(OFFSET(INDIRECT(AE29),2,5)>0,IF(COUNTIF(INDIRECT(AE30),(OFFSET(INDIRECT(AE29),0,5)))>0,OFFSET(INDIRECT(AE29),0,1),IF(COUNTIF(INDIRECT(AE30),(OFFSET(INDIRECT(AE29),1,5)))>0,OFFSET(INDIRECT(AE29),1,1),BlankMatchCompetitorText)),AwaitingMatchCompetitorText))","v":"Jožef GATEJ"},null,null,5,"W",{"$f":"IF(AK29=NormalWinState,AND(AK28=NormalLoseState,AJ29>AJ28),TRUE)","v":true},null,null,null,null,null,null,null,null,null,null,null,null,null,null,null,null,null,null,null,null,null,null,null,null,null,null,null,null,null,null,null,null,null,null,null,null,null,null,null,null,28,{"$f":"CB28","v":40},{"$f":"CC28+8","v":32},"$AF$40",{"$f":"CONCATENATE($B$2)","v":"3"},28,"8","09:00:00",5,"","13:19:00","14:03:00","00:44:00","Iztok DOLINŠEK ",111,5,"W","Jožef GATEJ",905,1,"L","F",true]
[null,null,null,null,null,null,"*",2,"12:36:00","13:21:00",{"$f":"IF(ISBLANK(I30),\"\",IF(ISBLANK(J30),CurrentTime-I30,J30-I30))","v":"00:45:00"},"F",{"$f":"IF(AND(COUNTIF(FinishedMatchStates,L30),NOT(ISNA(VLOOKUP(M28,MatchCompetitorStateCodes,1,FALSE))),NOT(ISNA(VLOOKUP(M29,MatchCompetitorStateCodes,1,FALSE))),COUNTIF(WinStates,M28)+COUNTIF(WinStates,M29)<=1,COUNTIF(LoseStates,M28)+COUNTIF(LoseStates,M29)<=1,IF(M28=NormalWinState,AND(M29=NormalLoseState,L28>L29),TRUE),IF(M29=NormalWinState,AND(M28=NormalLoseState,L29>L28),TRUE),NOT(ISBLANK(L27)),NOT(ISBLANK(I27)),NOT(ISBLANK(I30)),NOT(ISBLANK(J30)),H27>0),1,IF(COUNTIF(FinishedMatchStates,L30)>0,-1,0))","v":1},null,"*",null,null,null,{"$f":"IF(ISBLANK(Q30),\"\",IF(ISBLANK(R30),CurrentTime-Q30,R30-Q30))","v":""},null,{"$f":"IF(AND(COUNTIF(FinishedMatchStates,T30),NOT(ISNA(VLOOKUP(U28,MatchCompetitorStateCodes,1,FALSE))),NOT(ISNA(VLOOKUP(U29,MatchCompetitorStateCodes,1,FALSE))),COUNTIF(WinStates,U28)+COUNTIF(WinStates,U29)<=1,COUNTIF(LoseStates,U28)+COUNTIF(LoseStates,U29)<=1,IF(U28=NormalWinState,AND(U29=NormalLoseState,T28>T29),TRUE),IF(U29=NormalWinState,AND(U28=NormalLoseState,T29>T28),TRUE),NOT(ISBLANK(T27)),NOT(ISBLANK(Q27)),NOT(ISBLANK(Q30)),NOT(ISBLANK(R30)),P27>0),1,IF(COUNTIF(FinishedMatchStates,T30)>0,-1,0))","v":0},null,"*",null,null,null,{"$f":"IF(ISBLANK(Y30),\"\",IF(ISBLANK(Z30),CurrentTime-Y30,Z30-Y30))","v":""},null,{"$f":"IF(AND(COUNTIF(FinishedMatchStates,AB30),NOT(ISNA(VLOOKUP(AC28,MatchCompetitorStateCodes,1,FALSE))),NOT(ISNA(VLOOKUP(AC29,MatchCompetitorStateCodes,1,FALSE))),COUNTIF(WinStates,AC28)+COUNTIF(WinStates,AC29)<=1,COUNTIF(LoseStates,AC28)+COUNTIF(LoseStates,AC29)<=1,IF(AC28=NormalWinState,AND(AC29=NormalLoseState,AB28>AB29),TRUE),IF(AC29=NormalWinState,AND(AC28=NormalLoseState,AB29>AB28),TRUE),NOT(ISBLANK(AB27)),NOT(ISBLANK(Y27)),NOT(ISBLANK(Y30)),NOT(ISBLANK(Z30)),X27>0),1,IF(COUNTIF(FinishedMatchStates,AB30)>0,-1,0))","v":0},null,"*",7,"14:44:00","15:23:00",{"$f":"IF(ISBLANK(AG30),\"\",IF(ISBLANK(AH30),CurrentTime-AG30,AH30-AG30))","v":"00:39:00"},"F",{"$f":"IF(AND(COUNTIF(FinishedMatchStates,AJ30),NOT(ISNA(VLOOKUP(AK28,MatchCompetitorStateCodes,1,FALSE))),NOT(ISNA(VLOOKUP(AK29,MatchCompetitorStateCodes,1,FALSE))),COUNTIF(WinStates,AK28)+COUNTIF(WinStates,AK29)<=1,COUNTIF(LoseStates,AK28)+COUNTIF(LoseStates,AK29)<=1,IF(AK28=NormalWinState,AND(AK29=NormalLoseState,AJ28>AJ29),TRUE),IF(AK29=NormalWinState,AND(AK28=NormalLoseState,AJ29>AJ28),TRUE),NOT(ISBLANK(AJ27)),NOT(ISBLANK(AG27)),NOT(ISBLANK(AG30)),NOT(ISBLANK(AH30)),AF27>0),1,IF(COUNTIF(FinishedMatchStates,AJ30)>0,-1,0))","v":1}]
[]
[null,null,null,null,null,null,{"$f":"G26","v":1},{"$f":"H26+1","v":6},{"$f":"I26","v":1},{"$f":"((H32-1)*$B$3)+I32","v":21},1,6,null,null,{"$f":"G32","v":1},{"$f":"H32","v":6},{"$f":"I32+1","v":2},{"$f":"((P32-1)*$B$3)+Q32","v":22},2,5,null,null,{"$f":"O32","v":1},{"$f":"P32","v":6},{"$f":"Q32+1","v":3},{"$f":"((X32-1)*$B$3)+Y32","v":23},3,4,null,null,{"$f":"W32","v":1},{"$f":"X32","v":6},{"$f":"Y32+1","v":4},{"$f":"((AF32-1)*$B$3)+AG32","v":24},8,7]
[null,null,null,null,null,null,{"$f":"CELL(\"address\",OFFSET($A$5,K32,0))","v":"$A$6"},{"$f":"IF(AND(NOT(ISBLANK(I34)),I34<>UnsetMatchCompetitorText,I34<>AwaitingMatchCompetitorText,NOT(ISBLANK(I35)),I35<>UnsetMatchCompetitorText,I35<>AwaitingMatchCompetitorText),1,IF(AND(I34<>AwaitingMatchCompetitorText,I35<>AwaitingMatchCompetitorText),-1,0))","v":1},"09:00:00",null,null,5,null,null,{"$f":"CELL(\"address\",OFFSET($A$5,S32,0))","v":"$A$7"},{"$f":"IF(AND(NOT(ISBLANK(Q34)),Q34<>UnsetMatchCompetitorText,Q34<>AwaitingMatchCompetitorText,NOT(ISBLANK(Q35)),Q35<>UnsetMatchCompetitorText,Q35<>AwaitingMatchCompetitorText),1,IF(AND(Q34<>AwaitingMatchCompetitorText,Q35<>AwaitingMatchCompetitorText),-1,0))","v":1},"09:00:00",null,null,null,null,null,{"$f":"CELL(\"address\",OFFSET($A$5,AA32,0))","v":"$A$8"},{"$f":"IF(AND(NOT(ISBLANK(Y34)),Y34<>UnsetMatchCompetitorText,Y34<>AwaitingMatchCompetitorText,NOT(ISBLANK(Y35)),Y35<>UnsetMatchCompetitorText,Y35<>AwaitingMatchCompetitorText),1,IF(AND(Y34<>AwaitingMatchCompetitorText,Y35<>AwaitingMatchCompetitorText),-1,0))","v":1},"09:00:00",null,null,5,null,null,{"$f":"CELL(\"address\",OFFSET($A$5,AI32,0))","v":"$A$13"},{"$f":"IF(AND(NOT(ISBLANK(AG34)),AG34<>UnsetMatchCompetitorText,AG34<>AwaitingMatchCompetitorText,NOT(ISBLANK(AG35)),AG35<>UnsetMatchCompetitorText,AG35<>AwaitingMatchCompetitorText),1,IF(AND(AG34<>AwaitingMatchCompetitorText,AG35<>AwaitingMatchCompetitorText),-1,0))","v":1},"09:00:00"]
[null,null,null,null,null,null,"*",{"$f":"J32","v":21},{"$f":"IF(G34=\"*\",IF(AND(OFFSET(INDIRECT(G33),0,0)>0,NOT(ISNA(OFFSET(INDIRECT(G33),0,1)))),OFFSET(INDIRECT(G33),0,1),UnsetMatchCompetitorText),IF(OFFSET(INDIRECT(G33),2,5)>0,IF(COUNTIF(INDIRECT(G34),(OFFSET(INDIRECT(G33),0,5)))>0,OFFSET(INDIRECT(G33),0,1),IF(COUNTIF(INDIRECT(G34),(OFFSET(INDIRECT(G33),1,5)))>0,OFFSET(INDIRECT(G33),1,1),BlankMatchCompetitorText)),AwaitingMatchCompetitorText))","v":"Peter FIJAVŽ"},null,null,1,"L",{"$f":"IF(M34=NormalWinState,AND(M35=NormalLoseState,L34>L35),TRUE)","v":true},"*",{"$f":"R32","v":22},{"$f":"IF(O34=\"*\",IF(AND(OFFSET(INDIRECT(O33),0,0)>0,NOT(ISNA(OFFSET(INDIRECT(O33),0,1)))),OFFSET(INDIRECT(O33),0,1),UnsetMatchCompetitorText),IF(OFFSET(INDIRECT(O33),2,5)>0,IF(COUNTIF(INDIRECT(O34),(OFFSET(INDIRECT(O33),0,5)))>0,OFFSET(INDIRECT(O33),0,1),IF(COUNTIF(INDIRECT(O34),(OFFSET(INDIRECT(O33),1,5)))>0,OFFSET(INDIRECT(O33),1,1),BlankMatchCompetitorText)),AwaitingMatchCompetitorText))","v":""},null,null,null,null,{"$f":"IF(U34=NormalWinState,AND(U35=NormalLoseState,T34>T35),TRUE)","v":true},"*",{"$f":"Z32","v":23},{"$f":"IF(W34=\"*\",IF(AND(OFFSET(INDIRECT(W33),0,0)>0,NOT(ISNA(OFFSET(INDIRECT(W33),0,1)))),OFFSET(INDIRECT(W33),0,1),UnsetMatchCompetitorText),IF(OFFSET(INDIRECT(W33),2,5)>0,IF(COUNTIF(INDIRECT(W34),(OFFSET(INDIRECT(W33),0,5)))>0,OFFSET(INDIRECT(W33),0,1),IF(COUNTIF(INDIRECT(W34),(OFFSET(INDIRECT(W33),1,5)))>0,OFFSET(INDIRECT(W33),1,1),BlankMatchCompetitorText)),AwaitingMatchCompetitorText))","v":"Boštjan PEMIČ"},null,null,4,"L",{"$f":"IF(AC34=NormalWinState,AND(AC35=NormalLoseState,AB34>AB35),TRUE)","v":true},"*",{"$f":"AH32","v":24},{"$f":"IF(AE34=\"*\",IF(AND(OFFSET(INDIRECT(AE33),0,0)>0,NOT(ISNA(OFFSET(INDIRECT(AE33),0,1)))),OFFSET(INDIRECT(AE33),0,1),UnsetMatchCompetitorText),IF(OFFSET(INDIRECT(AE33),2,5)>0,IF(COUNTIF(INDIRECT(AE34),(OFFSET(INDIRECT(AE33),0,5)))>0,OFFSET(INDIRECT(AE33),0,1),IF(COUNTIF(INDIRECT(AE34),(OFFSET(INDIRECT(AE33),1,5)))>0,OFFSET(INDIRECT(AE33),1,1),BlankMatchCompetitorText)),AwaitingMatchCompetitorText))","v":"Jožef GATEJ"},null,null,null,null,{"$f":"IF(AK34=NormalWinState,AND(AK35=NormalLoseState,AJ34>AJ35),TRUE)","v":true}]
[null,null,null,null,null,null,{"$f":"CELL(\"address\",OFFSET($A$5,L32,0))","v":"$A$11"},null,{"$f":"IF(G36=\"*\",IF(AND(OFFSET(INDIRECT(G35),0,0)>0,NOT(ISNA(OFFSET(INDIRECT(G35),0,1)))),OFFSET(INDIRECT(G35),0,1),UnsetMatchCompetitorText),IF(OFFSET(INDIRECT(G35),2,5)>0,IF(COUNTIF(INDIRECT(G36),(OFFSET(INDIRECT(G35),0,5)))>0,OFFSET(INDIRECT(G35),0,1),IF(COUNTIF(INDIRECT(G36),(OFFSET(INDIRECT(G35),1,5)))>0,OFFSET(INDIRECT(G35),1,1),BlankMatchCompetitorText)),AwaitingMatchCompetitorText))","v":"Miha ŽAGAR"},null,null,5,"W",{"$f":"IF(M35=NormalWinState,AND(M34=NormalLoseState,L35>L34),TRUE)","v":true},{"$f":"CELL(\"address\",OFFSET($A$5,T32,0))","v":"$A$10"},null,{"$f":"IF(O36=\"*\",IF(AND(OFFSET(INDIRECT(O35),0,0)>0,NOT(ISNA(OFFSET(INDIRECT(O35),0,1)))),OFFSET(INDIRECT(O35),0,1),UnsetMatchCompetitorText),IF(OFFSET(INDIRECT(O35),2,5)>0,IF(COUNTIF(INDIRECT(O36),(OFFSET(INDIRECT(O35),0,5)))>0,OFFSET(INDIRECT(O35),0,1),IF(COUNTIF(INDIRECT(O36),(OFFSET(INDIRECT(O35),1,5)))>0,OFFSET(INDIRECT(O35),1,1),BlankMatchCompetitorText)),AwaitingMatchCompetitorText))","v":"Aleksander RAIŠIČ"},null,null,null,null,{"$f":"IF(U35=NormalWinState,AND(U34=NormalLoseState,T35>T34),TRUE)","v":true},{"$f":"CELL(\"address\",OFFSET($A$5,AB32,0))","v":"$A$9"},null,{"$f":"IF(W36=\"*\",IF(AND(OFFSET(INDIRECT(W35),0,0)>0,NOT(ISNA(OFFSET(INDIRECT(W35),0,1)))),OFFSET(INDIRECT(W35),0,1),UnsetMatchCompetitorText),IF(OFFSET(INDIRECT(W35),2,5)>0,IF(COUNTIF(INDIRECT(W36),(OFFSET(INDIRECT(W35),0,5)))>0,OFFSET(INDIRECT(W35),0,1),IF(COUNTIF(INDIRECT(W36),(OFFSET(INDIRECT(W35),1,5)))>0,OFFSET(INDIRECT(W35),1,1),BlankMatchCompetitorText)),AwaitingMatchCompetitorText))","v":"Iztok DOLINŠEK "},null,null,5,"W",{"$f":"IF(AC35=NormalWinState,AND(AC34=NormalLoseState,AB35>AB34),TRUE)","v":true},{"$f":"CELL(\"address\",OFFSET($A$5,AJ32,0))","v":"$A$12"},null,{"$f":"IF(AE36=\"*\",IF(AND(OFFSET(INDIRECT(AE35),0,0)>0,NOT(ISNA(OFFSET(INDIRECT(AE35),0,1)))),OFFSET(INDIRECT(AE35),0,1),UnsetMatchCompetitorText),IF(OFFSET(INDIRECT(AE35),2,5)>0,IF(COUNTIF(INDIRECT(AE36),(OFFSET(INDIRECT(AE35),0,5)))>0,OFFSET(INDIRECT(AE35),0,1),IF(COUNTIF(INDIRECT(AE36),(OFFSET(INDIRECT(AE35),1,5)))>0,OFFSET(INDIRECT(AE35),1,1),BlankMatchCompetitorText)),AwaitingMatchCompetitorText))","v":""},null,null,null,null,{"$f":"IF(AK35=NormalWinState,AND(AK34=NormalLoseState,AJ35>AJ34),TRUE)","v":true}]
[null,null,null,null,null,null,"*",5,"09:58:00","10:49:00",{"$f":"IF(ISBLANK(I36),\"\",IF(ISBLANK(J36),CurrentTime-I36,J36-I36))","v":"00:51:00"},"F",{"$f":"IF(AND(COUNTIF(FinishedMatchStates,L36),NOT(ISNA(VLOOKUP(M34,MatchCompetitorStateCodes,1,FALSE))),NOT(ISNA(VLOOKUP(M35,MatchCompetitorStateCodes,1,FALSE))),COUNTIF(WinStates,M34)+COUNTIF(WinStates,M35)<=1,COUNTIF(LoseStates,M34)+COUNTIF(LoseStates,M35)<=1,IF(M34=NormalWinState,AND(M35=NormalLoseState,L34>L35),TRUE),IF(M35=NormalWinState,AND(M34=NormalLoseState,L35>L34),TRUE),NOT(ISBLANK(L33)),NOT(ISBLANK(I33)),NOT(ISBLANK(I36)),NOT(ISBLANK(J36)),H33>0),1,IF(COUNTIF(FinishedMatchStates,L36)>0,-1,0))","v":1},null,"*",null,null,null,{"$f":"IF(ISBLANK(Q36),\"\",IF(ISBLANK(R36),CurrentTime-Q36,R36-Q36))","v":""},null,{"$f":"IF(AND(COUNTIF(FinishedMatchStates,T36),NOT(ISNA(VLOOKUP(U34,MatchCompetitorStateCodes,1,FALSE))),NOT(ISNA(VLOOKUP(U35,MatchCompetitorStateCodes,1,FALSE))),COUNTIF(WinStates,U34)+COUNTIF(WinStates,U35)<=1,COUNTIF(LoseStates,U34)+COUNTIF(LoseStates,U35)<=1,IF(U34=NormalWinState,AND(U35=NormalLoseState,T34>T35),TRUE),IF(U35=NormalWinState,AND(U34=NormalLoseState,T35>T34),TRUE),NOT(ISBLANK(T33)),NOT(ISBLANK(Q33)),NOT(ISBLANK(Q36)),NOT(ISBLANK(R36)),P33>0),1,IF(COUNTIF(FinishedMatchStates,T36)>0,-1,0))","v":0},null,"*",7,"12:17:00","13:06:00",{"$f":"IF(ISBLANK(Y36),\"\",IF(ISBLANK(Z36),CurrentTime-Y36,Z36-Y36))","v":"00:49:00"},"F",{"$f":"IF(AND(COUNTIF(FinishedMatchStates,AB36),NOT(ISNA(VLOOKUP(AC34,MatchCompetitorStateCodes,1,FALSE))),NOT(ISNA(VLOOKUP(AC35,MatchCompetitorStateCodes,1,FALSE))),COUNTIF(WinStates,AC34)+COUNTIF(WinStates,AC35)<=1,COUNTIF(LoseStates,AC34)+COUNTIF(LoseStates,AC35)<=1,IF(AC34=NormalWinState,AND(AC35=NormalLoseState,AB34>AB35),TRUE),IF(AC35=NormalWinState,AND(AC34=NormalLoseState,AB35>AB34),TRUE),NOT(ISBLANK(AB33)),NOT(ISBLANK(Y33)),NOT(ISBLANK(Y36)),NOT(ISBLANK(Z36)),X33>0),1,IF(COUNTIF(FinishedMatchStates,AB36)>0,-1,0))","v":1},null,"*",null,null,null,{"$f":"IF(ISBLANK(AG36),\"\",IF(ISBLANK(AH36),CurrentTime-AG36,AH36-AG36))","v":""},null,{"$f":"IF(AND(COUNTIF(FinishedMatchStates,AJ36),NOT(ISNA(VLOOKUP(AK34,MatchCompetitorStateCodes,1,FALSE))),NOT(ISNA(VLOOKUP(AK35,MatchCompetitorStateCodes,1,FALSE))),COUNTIF(WinStates,AK34)+COUNTIF(WinStates,AK35)<=1,COUNTIF(LoseStates,AK34)+COUNTIF(LoseStates,AK35)<=1,IF(AK34=NormalWinState,AND(AK35=NormalLoseState,AJ34>AJ35),TRUE),IF(AK35=NormalWinState,AND(AK34=NormalLoseState,AJ35>AJ34),TRUE),NOT(ISBLANK(AJ33)),NOT(ISBLANK(AG33)),NOT(ISBLANK(AG36)),NOT(ISBLANK(AH36)),AF33>0),1,IF(COUNTIF(FinishedMatchStates,AJ36)>0,-1,0))","v":0}]
[]
[null,null,null,null,null,null,{"$f":"G32","v":1},{"$f":"H32+1","v":7},{"$f":"I32","v":1},{"$f":"((H38-1)*$B$3)+I38","v":25},7,1,null,null,{"$f":"G38","v":1},{"$f":"H38","v":7},{"$f":"I38+1","v":2},{"$f":"((P38-1)*$B$3)+Q38","v":26},6,2,null,null,{"$f":"O38","v":1},{"$f":"P38","v":7},{"$f":"Q38+1","v":3},{"$f":"((X38-1)*$B$3)+Y38","v":27},5,3,null,null,{"$f":"W38","v":1},{"$f":"X38","v":7},{"$f":"Y38+1","v":4},{"$f":"((AF38-1)*$B$3)+AG38","v":28},4,8]
[null,null,null,null,null,null,{"$f":"CELL(\"address\",OFFSET($A$5,K38,0))","v":"$A$12"},{"$f":"IF(AND(NOT(ISBLANK(I40)),I40<>UnsetMatchCompetitorText,I40<>AwaitingMatchCompetitorText,NOT(ISBLANK(I41)),I41<>UnsetMatchCompetitorText,I41<>AwaitingMatchCompetitorText),1,IF(AND(I40<>AwaitingMatchCompetitorText,I41<>AwaitingMatchCompetitorText),-1,0))","v":1},"09:00:00",null,null,null,null,null,{"$f":"CELL(\"address\",OFFSET($A$5,S38,0))","v":"$A$11"},{"$f":"IF(AND(NOT(ISBLANK(Q40)),Q40<>UnsetMatchCompetitorText,Q40<>AwaitingMatchCompetitorText,NOT(ISBLANK(Q41)),Q41<>UnsetMatchCompetitorText,Q41<>AwaitingMatchCompetitorText),1,IF(AND(Q40<>AwaitingMatchCompetitorText,Q41<>AwaitingMatchCompetitorText),-1,0))","v":1},"09:00:00",null,null,null,null,null,{"$f":"CELL(\"address\",OFFSET($A$5,AA38,0))","v":"$A$10"},{"$f":"IF(AND(NOT(ISBLANK(Y40)),Y40<>UnsetMatchCompetitorText,Y40<>AwaitingMatchCompetitorText,NOT(ISBLANK(Y41)),Y41<>UnsetMatchCompetitorText,Y41<>AwaitingMatchCompetitorText),1,IF(AND(Y40<>AwaitingMatchCompetitorText,Y41<>AwaitingMatchCompetitorText),-1,0))","v":1},"09:00:00",null,null,5,null,null,{"$f":"CELL(\"address\",OFFSET($A$5,AI38,0))","v":"$A$9"},{"$f":"IF(AND(NOT(ISBLANK(AG40)),AG40<>UnsetMatchCompetitorText,AG40<>AwaitingMatchCompetitorText,NOT(ISBLANK(AG41)),AG41<>UnsetMatchCompetitorText,AG41<>AwaitingMatchCompetitorText),1,IF(AND(AG40<>AwaitingMatchCompetitorText,AG41<>AwaitingMatchCompetitorText),-1,0))","v":1},"09:00:00",null,null,5]
[null,null,null,null,null,null,"*",{"$f":"J38","v":25},{"$f":"IF(G40=\"*\",IF(AND(OFFSET(INDIRECT(G39),0,0)>0,NOT(ISNA(OFFSET(INDIRECT(G39),0,1)))),OFFSET(INDIRECT(G39),0,1),UnsetMatchCompetitorText),IF(OFFSET(INDIRECT(G39),2,5)>0,IF(COUNTIF(INDIRECT(G40),(OFFSET(INDIRECT(G39),0,5)))>0,OFFSET(INDIRECT(G39),0,1),IF(COUNTIF(INDIRECT(G40),(OFFSET(INDIRECT(G39),1,5)))>0,OFFSET(INDIRECT(G39),1,1),BlankMatchCompetitorText)),AwaitingMatchCompetitorText))","v":""},null,null,null,null,{"$f":"IF(M40=NormalWinState,AND(M41=NormalLoseState,L40>L41),TRUE)","v":true},"*",{"$f":"R38","v":26},{"$f":"IF(O40=\"*\",IF(AND(OFFSET(INDIRECT(O39),0,0)>0,NOT(ISNA(OFFSET(INDIRECT(O39),0,1)))),OFFSET(INDIRECT(O39),0,1),UnsetMatchCompetitorText),IF(OFFSET(INDIRECT(O39),2,5)>0,IF(COUNTIF(INDIRECT(O40),(OFFSET(INDIRECT(O39),0,5)))>0,OFFSET(INDIRECT(O39),0,1),IF(COUNTIF(INDIRECT(O40),(OFFSET(INDIRECT(O39),1,5)))>0,OFFSET(INDIRECT(O39),1,1),BlankMatchCompetitorText)),AwaitingMatchCompetitorText))","v":"Miha ŽAGAR"},null,null,null,null,{"$f":"IF(U40=NormalWinState,AND(U41=NormalLoseState,T40>T41),TRUE)","v":true},"*",{"$f":"Z38","v":27},{"$f":"IF(W40=\"*\",IF(AND(OFFSET(INDIRECT(W39),0,0)>0,NOT(ISNA(OFFSET(INDIRECT(W39),0,1)))),OFFSET(INDIRECT(W39),0,1),UnsetMatchCompetitorText),IF(OFFSET(INDIRECT(W39),2,5)>0,IF(COUNTIF(INDIRECT(W40),(OFFSET(INDIRECT(W39),0,5)))>0,OFFSET(INDIRECT(W39),0,1),IF(COUNTIF(INDIRECT(W40),(OFFSET(INDIRECT(W39),1,5)))>0,OFFSET(INDIRECT(W39),1,1),BlankMatchCompetitorText)),AwaitingMatchCompetitorText))","v":"Aleksander RAIŠIČ"},null,null,1,"L",{"$f":"IF(AC40=NormalWinState,AND(AC41=NormalLoseState,AB40>AB41),TRUE)","v":true},"*",{"$f":"AH38","v":28},{"$f":"IF(AE40=\"*\",IF(AND(OFFSET(INDIRECT(AE39),0,0)>0,NOT(ISNA(OFFSET(INDIRECT(AE39),0,1)))),OFFSET(INDIRECT(AE39),0,1),UnsetMatchCompetitorText),IF(OFFSET(INDIRECT(AE39),2,5)>0,IF(COUNTIF(INDIRECT(AE40),(OFFSET(INDIRECT(AE39),0,5)))>0,OFFSET(INDIRECT(AE39),0,1),IF(COUNTIF(INDIRECT(AE40),(OFFSET(INDIRECT(AE39),1,5)))>0,OFFSET(INDIRECT(AE39),1,1),BlankMatchCompetitorText)),AwaitingMatchCompetitorText))","v":"Iztok DOLINŠEK "},null,null,5,"W",{"$f":"IF(AK40=NormalWinState,AND(AK41=NormalLoseState,AJ40>AJ41),TRUE)","v":true}]
[null,null,null,null,null,null,{"$f":"CELL(\"address\",OFFSET($A$5,L38,0))","v":"$A$6"},null,{"$f":"IF(G42=\"*\",IF(AND(OFFSET(INDIRECT(G41),0,0)>0,NOT(ISNA(OFFSET(INDIRECT(G41),0,1)))),OFFSET(INDIRECT(G41),0,1),UnsetMatchCompetitorText),IF(OFFSET(INDIRECT(G41),2,5)>0,IF(COUNTIF(INDIRECT(G42),(OFFSET(INDIRECT(G41),0,5)))>0,OFFSET(INDIRECT(G41),0,1),IF(COUNTIF(INDIRECT(G42),(OFFSET(INDIRECT(G41),1,5)))>0,OFFSET(INDIRECT(G41),1,1),BlankMatchCompetitorText)),AwaitingMatchCompetitorText))","v":"Peter FIJAVŽ"},null,null,null,null,{"$f":"IF(M41=NormalWinState,AND(M40=NormalLoseState,L41>L40),TRUE)","v":true},{"$f":"CELL(\"address\",OFFSET($A$5,T38,0))","v":"$A$7"},null,{"$f":"IF(O42=\"*\",IF(AND(OFFSET(INDIRECT(O41),0,0)>0,NOT(ISNA(OFFSET(INDIRECT(O41),0,1)))),OFFSET(INDIRECT(O41),0,1),UnsetMatchCompetitorText),IF(OFFSET(INDIRECT(O41),2,5)>0,IF(COUNTIF(INDIRECT(O42),(OFFSET(INDIRECT(O41),0,5)))>0,OFFSET(INDIRECT(O41),0,1),IF(COUNTIF(INDIRECT(O42),(OFFSET(INDIRECT(O41),1,5)))>0,OFFSET(INDIRECT(O41),1,1),BlankMatchCompetitorText)),AwaitingMatchCompetitorText))","v":""},null,null,null,null,{"$f":"IF(U41=NormalWinState,AND(U40=NormalLoseState,T41>T40),TRUE)","v":true},{"$f":"CELL(\"address\",OFFSET($A$5,AB38,0))","v":"$A$8"},null,{"$f":"IF(W42=\"*\",IF(AND(OFFSET(INDIRECT(W41),0,0)>0,NOT(ISNA(OFFSET(INDIRECT(W41),0,1)))),OFFSET(INDIRECT(W41),0,1),UnsetMatchCompetitorText),IF(OFFSET(INDIRECT(W41),2,5)>0,IF(COUNTIF(INDIRECT(W42),(OFFSET(INDIRECT(W41),0,5)))>0,OFFSET(INDIRECT(W41),0,1),IF(COUNTIF(INDIRECT(W42),(OFFSET(INDIRECT(W41),1,5)))>0,OFFSET(INDIRECT(W41),1,1),BlankMatchCompetitorText)),AwaitingMatchCompetitorText))","v":"Boštjan PEMIČ"},null,null,5,"W",{"$f":"IF(AC41=NormalWinState,AND(AC40=NormalLoseState,AB41>AB40),TRUE)","v":true},{"$f":"CELL(\"address\",OFFSET($A$5,AJ38,0))","v":"$A$13"},null,{"$f":"IF(AE42=\"*\",IF(AND(OFFSET(INDIRECT(AE41),0,0)>0,NOT(ISNA(OFFSET(INDIRECT(AE41),0,1)))),OFFSET(INDIRECT(AE41),0,1),UnsetMatchCompetitorText),IF(OFFSET(INDIRECT(AE41),2,5)>0,IF(COUNTIF(INDIRECT(AE42),(OFFSET(INDIRECT(AE41),0,5)))>0,OFFSET(INDIRECT(AE41),0,1),IF(COUNTIF(INDIRECT(AE42),(OFFSET(INDIRECT(AE41),1,5)))>0,OFFSET(INDIRECT(AE41),1,1),BlankMatchCompetitorText)),AwaitingMatchCompetitorText))","v":"Jožef GATEJ"},null,null,1,"L",{"$f":"IF(AK41=NormalWinState,AND(AK40=NormalLoseState,AJ41>AJ40),TRUE)","v":true}]
[null,null,null,null,null,null,"*",null,null,null,{"$f":"IF(ISBLANK(I42),\"\",IF(ISBLANK(J42),CurrentTime-I42,J42-I42))","v":""},null,{"$f":"IF(AND(COUNTIF(FinishedMatchStates,L42),NOT(ISNA(VLOOKUP(M40,MatchCompetitorStateCodes,1,FALSE))),NOT(ISNA(VLOOKUP(M41,MatchCompetitorStateCodes,1,FALSE))),COUNTIF(WinStates,M40)+COUNTIF(WinStates,M41)<=1,COUNTIF(LoseStates,M40)+COUNTIF(LoseStates,M41)<=1,IF(M40=NormalWinState,AND(M41=NormalLoseState,L40>L41),TRUE),IF(M41=NormalWinState,AND(M40=NormalLoseState,L41>L40),TRUE),NOT(ISBLANK(L39)),NOT(ISBLANK(I39)),NOT(ISBLANK(I42)),NOT(ISBLANK(J42)),H39>0),1,IF(COUNTIF(FinishedMatchStates,L42)>0,-1,0))","v":0},null,"*",null,null,null,{"$f":"IF(ISBLANK(Q42),\"\",IF(ISBLANK(R42),CurrentTime-Q42,R42-Q42))","v":""},null,{"$f":"IF(AND(COUNTIF(FinishedMatchStates,T42),NOT(ISNA(VLOOKUP(U40,MatchCompetitorStateCodes,1,FALSE))),NOT(ISNA(VLOOKUP(U41,MatchCompetitorStateCodes,1,FALSE))),COUNTIF(WinStates,U40)+COUNTIF(WinStates,U41)<=1,COUNTIF(LoseStates,U40)+COUNTIF(LoseStates,U41)<=1,IF(U40=NormalWinState,AND(U41=NormalLoseState,T40>T41),TRUE),IF(U41=NormalWinState,AND(U40=NormalLoseState,T41>T40),TRUE),NOT(ISBLANK(T39)),NOT(ISBLANK(Q39)),NOT(ISBLANK(Q42)),NOT(ISBLANK(R42)),P39>0),1,IF(COUNTIF(FinishedMatchStates,T42)>0,-1,0))","v":0},null,"*",7,"14:04:00","14:43:00",{"$f":"IF(ISBLANK(Y42),\"\",IF(ISBLANK(Z42),CurrentTime-Y42,Z42-Y42))","v":"00:39:00"},"F",{"$f":"IF(AND(COUNTIF(FinishedMatchStates,AB42),NOT(ISNA(VLOOKUP(AC40,MatchCompetitorStateCodes,1,FALSE))),NOT(ISNA(VLOOKUP(AC41,MatchCompetitorStateCodes,1,FALSE))),COUNTIF(WinStates,AC40)+COUNTIF(WinStates,AC41)<=1,COUNTIF(LoseStates,AC40)+COUNTIF(LoseStates,AC41)<=1,IF(AC40=NormalWinState,AND(AC41=NormalLoseState,AB40>AB41),TRUE),IF(AC41=NormalWinState,AND(AC40=NormalLoseState,AB41>AB40),TRUE),NOT(ISBLANK(AB39)),NOT(ISBLANK(Y39)),NOT(ISBLANK(Y42)),NOT(ISBLANK(Z42)),X39>0),1,IF(COUNTIF(FinishedMatchStates,AB42)>0,-1,0))","v":1},null,"*",8,"13:19:00","14:03:00",{"$f":"IF(ISBLANK(AG42),\"\",IF(ISBLANK(AH42),CurrentTime-AG42,AH42-AG42))","v":"00:44:00"},"F",{"$f":"IF(AND(COUNTIF(FinishedMatchStates,AJ42),NOT(ISNA(VLOOKUP(AK40,MatchCompetitorStateCodes,1,FALSE))),NOT(ISNA(VLOOKUP(AK41,MatchCompetitorStateCodes,1,FALSE))),COUNTIF(WinStates,AK40)+COUNTIF(WinStates,AK41)<=1,COUNTIF(LoseStates,AK40)+COUNTIF(LoseStates,AK41)<=1,IF(AK40=NormalWinState,AND(AK41=NormalLoseState,AJ40>AJ41),TRUE),IF(AK41=NormalWinState,AND(AK40=NormalLoseState,AJ41>AJ40),TRUE),NOT(ISBLANK(AJ39)),NOT(ISBLANK(AG39)),NOT(ISBLANK(AG42)),NOT(ISBLANK(AH42)),AF39>0),1,IF(COUNTIF(FinishedMatchStates,AJ42)>0,-1,0))","v":1}]

{"sheet":"Skupina 4","index":6,"n_rows":42,"n_cols":101,"rows_kept":42,"cut":false,"hidden":false,"merged":[[0,0,0,4],[2,9,2,10],[2,17,2,18],[2,25,2,26],[2,33,2,34],[3,7,4,7],[3,8,3,10],[3,15,4,15],[3,16,3,18],[3,23,4,23],[5,53,6,53],[7,53,8,53],[8,9,8,10],[8,17,8,18],[8,25,8,26],[8,33,8,34],[3,24,3,26],[3,31,4,31],[3,32,3,34],[3,53,4,53],[4,8,4,10],[4,16,4,18],[4,24,4,26],[4,32,4,34],[15,7,16,7],[15,8,15,10],[15,15,16,15],[15,16,15,18],[15,23,16,23],[15,24,15,26],[9,31,10,31],[9,32,9,34],[9,53,10,53],[10,8,10,10],[10,16,10,18],[10,24,10,26],[10,32,10,34],[9,7,10,7],[9,8,9,10],[9,15,10,15],[9,16,9,18],[9,23,10,23],[9,24,9,26],[15,31,16,31],[15,32,15,34],[16,8,16,10],[16,16,16,18],[16,24,16,26],[16,32,16,34],[14,9,14,10],[14,17,14,18],[14,25,14,26],[14,33,14,34],[20,9,20,10],[20,17,20,18],[20,25,20,26],[20,33,20,34],[21,7,22,7],[21,8,21,10],[21,15,22,15],[21,16,21,18],[21,23,22,23],[21,24,21,26],[27,7,28,7],[27,8,27,10],[27,15,28,15],[27,16,27,18],[27,23,28,23],[27,24,27,26],[21,31,22,31],[21,32,21,34],[22,8,22,10],[22,16,22,18],[22,24,22,26],[22,32,22,34],[27,31,28,31],[27,32,27,34],[28,8,28,10],[28,16,28,18],[28,24,28,26],[28,32,28,34],[26,9,26,10],[26,17,26,18],[26,25,26,26],[26,33,26,34],[32,9,32,10],[32,17,32,18],[32,25,32,26],[32,33,32,34],[33,7,34,7],[33,8,33,10],[33,15,34,15],[33,16,33,18],[33,23,34,23],[33,24,33,26],[39,7,40,7],[39,8,39,10],[39,15,40,15],[39,16,39,18],[39,23,40,23],[39,24,39,26],[33,31,34,31],[33,32,33,34],[34,8,34,10],[34,16,34,18],[34,24,34,26],[34,32,34,34],[39,31,40,31],[39,32,39,34],[40,8,40,10],[40,16,40,18],[40,24,40,26],[40,32,40,34],[38,9,38,10],[38,17,38,18],[38,25,38,26],[38,33,38,34]]}
["Nastavitve",null,null,null,null,null,"Group","Round","Order","Match","P1","P2",null,null,null,null,null,null,null,null,null,null,null,null,null,null,null,null,null,null,null,null,null,null,null,null,null,null,null,null,null,null,null,null,null,null,null,null,null,null,null,null,null,null,null,null,null,null,null,null,null,null,null,null,null,null,null,null,null,null,null,null,null,null,null,null,null,null,"Match","Row","Col","Address","Group","Match nr.","Table","Scheduled time","Target","Notes","Start time","End time","Duration","P1 Name","P1 Code","P1 Score","P1 State","P2 Name","P2 Code","P2 Score","P2 State","Match State","Is Valid"]
["Skupina",4,null,null,null,null,1,1,1,{"$f":"((H2-1)*$B$3)+I2","v":1},2,7,null,null,{"$f":"G2","v":1},{"$f":"H2","v":1},{"$f":"I2+1","v":2},{"$f":"((P2-1)*$B$3)+Q2","v":2},3,6,null,null,{"$f":"O2","v":1},{"$f":"P2","v":1},{"$f":"Q2+1","v":3},{"$f":"((X2-1)*$B$3)+Y2","v":3},4,5,null,null,{"$f":"W2","v":1},{"$f":"X2","v":1},{"$f":"Y2+1","v":4},{"$f":"((AF2-1)*$B$3)+AG2","v":4},1,8,null,null,null,null,null,null,null,null,null,null,null,null,null,null,null,null,null,null,null,null,null,null,null,null,null,null,null,null,null,null,null,null,null,null,null,null,null,null,null,null,null,null,1,{"$f":"ROW(H4)","v":4},{"$f":"COLUMN(H4)","v":8},{"$f":"ADDRESS(CB2,CC2)","v":"$H$4"},{"$f":"CONCATENATE($B$2)","v":"4"},{"$f":"INDIRECT(CD2)","v":1},{"$f":"CONCATENATE(OFFSET(INDIRECT(CD2),2,0))","v":""},{"$f":"OFFSET(INDIRECT(CD2),-1,1)","v":"09:00:00"},{"$f":"OFFSET(INDIRECT(CD2),-1,4)","v":0},{"$f":"CONCATENATE(OFFSET(INDIRECT(CD2),-1,2))","v":""},{"$f":"OFFSET(INDIRECT(CD2),2,1)","v":"00:00:00"},{"$f":"OFFSET(INDIRECT(CD2),2,2)","v":"00:00:00"},{"$f":"OFFSET(INDIRECT(CD2),2,3)","v":""},{"$f":"OFFSET(INDIRECT(CD2),0,1)","v":""},{"$f":"VLOOKUP(CN2,AnnouncementListCompetitors,6,FALSE)","v":0},{"$f":"OFFSET(INDIRECT(CD2),0,4)","v":0},{"$f":"OFFSET(INDIRECT(CD2),0,5)","v":0},{"$f":"OFFSET(INDIRECT(CD2),1,1)","v":""},{"$f":"VLOOKUP(CR2,AnnouncementListCompetitors,6,FALSE)","v":0},{"$f":"OFFSET(INDIRECT(CD2),1,4)","v":0},{"$f":"OFFSET(INDIRECT(CD2),1,5)","v":0},{"$f":"OFFSET(INDIRECT(CD2),2,4)","v":0},{"$f":"IF(OFFSET(INDIRECT(CD2),2,5)=1,TRUE,FALSE)","v":false}]
["Št. dvobojev na kolo",4,null,null,null,null,{"$f":"CELL(\"address\",OFFSET($A$5,K2,0))","v":"$A$7"},{"$f":"IF(AND(NOT(ISBLANK(I4)),I4<>UnsetMatchCompetitorText,I4<>AwaitingMatchCompetitorText,NOT(ISBLANK(I5)),I5<>UnsetMatchCompetitorText,I5<>AwaitingMatchCompetitorText),1,IF(AND(I4<>AwaitingMatchCompetitorText,I5<>AwaitingMatchCompetitorText),-1,0))","v":1},"09:00:00",null,null,null,null,null,{"$f":"CELL(\"address\",OFFSET($A$5,S2,0))","v":"$A$8"},{"$f":"IF(AND(NOT(ISBLANK(Q4)),Q4<>UnsetMatchCompetitorText,Q4<>AwaitingMatchCompetitorText,NOT(ISBLANK(Q5)),Q5<>UnsetMatchCompetitorText,Q5<>AwaitingMatchCompetitorText),1,IF(AND(Q4<>AwaitingMatchCompetitorText,Q5<>AwaitingMatchCompetitorText),-1,0))","v":1},"09:00:00",null,null,null,null,null,{"$f":"CELL(\"address\",OFFSET($A$5,AA2,0))","v":"$A$9"},{"$f":"IF(AND(NOT(ISBLANK(Y4)),Y4<>UnsetMatchCompetitorText,Y4<>AwaitingMatchCompetitorText,NOT(ISBLANK(Y5)),Y5<>UnsetMatchCompetitorText,Y5<>AwaitingMatchCompetitorText),1,IF(AND(Y4<>AwaitingMatchCompetitorText,Y5<>AwaitingMatchCompetitorText),-1,0))","v":1},"09:00:00",null,null,5,null,null,{"$f":"CELL(\"address\",OFFSET($A$5,AI2,0))","v":"$A$6"},{"$f":"IF(AND(NOT(ISBLANK(AG4)),AG4<>UnsetMatchCompetitorText,AG4<>AwaitingMatchCompetitorText,NOT(ISBLANK(AG5)),AG5<>UnsetMatchCompetitorText,AG5<>AwaitingMatchCompetitorText),1,IF(AND(AG4<>AwaitingMatchCompetitorText,AG5<>AwaitingMatchCompetitorText),-1,0))","v":1},"09:00:00",null,null,5,null,null,null,null,null,null,null,null,null,null,null,null,null,null,null,null,null,null,"Tekmovalec","Tekme","+","-","+/-","Zmage","Poz.","Uvrst.","Žreb",null,null,"R",null,"S",null,null,null,null,null,null,null,null,null,null,2,{"$f":"CB2","v":4},{"$f":"CC2+8","v":16},"$P$4",{"$f":"CONCATENATE($B$2)","v":"4"},2,"","09:00:00",0,"","00:00:00","00:00:00","","",0,0,0,"Tomaž BENEDIČIČ",1,0,0,0,false]
[null,null,null,null,null,null,"*",{"$f":"J2","v":1},{"$f":"IF(G4=\"*\",IF(AND(OFFSET(INDIRECT(G3),0,0)>0,NOT(ISNA(OFFSET(INDIRECT(G3),0,1)))),OFFSET(INDIRECT(G3),0,1),UnsetMatchCompetitorText),IF(OFFSET(INDIRECT(G3),2,5)>0,IF(COUNTIF(INDIRECT(G4),(OFFSET(INDIRECT(G3),0,5)))>0,OFFSET(INDIRECT(G3),0,1),IF(COUNTIF(INDIRECT(G4),(OFFSET(INDIRECT(G3),1,5)))>0,OFFSET(INDIRECT(G3),1,1),BlankMatchCompetitorText)),AwaitingMatchCompetitorText))","v":""},null,null,null,null,{"$f":"IF(M4=NormalWinState,AND(M5=NormalLoseState,L4>L5),TRUE)","v":true},"*",{"$f":"R2","v":2},{"$f":"IF(O4=\"*\",IF(AND(OFFSET(INDIRECT(O3),0,0)>0,NOT(ISNA(OFFSET(INDIRECT(O3),0,1)))),OFFSET(INDIRECT(O3),0,1),UnsetMatchCompetitorText),IF(OFFSET(INDIRECT(O3),2,5)>0,IF(COUNTIF(INDIRECT(O4),(OFFSET(INDIRECT(O3),0,5)))>0,OFFSET(INDIRECT(O3),0,1),IF(COUNTIF(INDIRECT(O4),(OFFSET(INDIRECT(O3),1,5)))>0,OFFSET(INDIRECT(O3),1,1),BlankMatchCompetitorText)),AwaitingMatchCompetitorText))","v":""},null,null,null,null,{"$f":"IF(U4=NormalWinState,AND(U5=NormalLoseState,T4>T5),TRUE)","v":true},"*",{"$f":"Z2","v":3},{"$f":"IF(W4=\"*\",IF(AND(OFFSET(INDIRECT(W3),0,0)>0,NOT(ISNA(OFFSET(INDIRECT(W3),0,1)))),OFFSET(INDIRECT(W3),0,1),UnsetMatchCompetitorText),IF(OFFSET(INDIRECT(W3),2,5)>0,IF(COUNTIF(INDIRECT(W4),(OFFSET(INDIRECT(W3),0,5)))>0,OFFSET(INDIRECT(W3),0,1),IF(COUNTIF(INDIRECT(W4),(OFFSET(INDIRECT(W3),1,5)))>0,OFFSET(INDIRECT(W3),1,1),BlankMatchCompetitorText)),AwaitingMatchCompetitorText))","v":"Nino PORIČ"},null,null,null,"WO",{"$f":"IF(AC4=NormalWinState,AND(AC5=NormalLoseState,AB4>AB5),TRUE)","v":true},"*",{"$f":"AH2","v":4},{"$f":"IF(AE4=\"*\",IF(AND(OFFSET(INDIRECT(AE3),0,0)>0,NOT(ISNA(OFFSET(INDIRECT(AE3),0,1)))),OFFSET(INDIRECT(AE3),0,1),UnsetMatchCompetitorText),IF(OFFSET(INDIRECT(AE3),2,5)>0,IF(COUNTIF(INDIRECT(AE4),(OFFSET(INDIRECT(AE3),0,5)))>0,OFFSET(INDIRECT(AE3),0,1),IF(COUNTIF(INDIRECT(AE4),(OFFSET(INDIRECT(AE3),1,5)))>0,OFFSET(INDIRECT(AE3),1,1),BlankMatchCompetitorText)),AwaitingMatchCompetitorText))","v":"Franci ČUČNIK"},null,null,null,"WO",{"$f":"IF(AK4=NormalWinState,AND(AK5=NormalLoseState,AJ4>AJ5),TRUE)","v":true},null,null,null,null,null,null,null,null,null,null,null,null,null,null,null,null,{"$f":"B6","v":"Franci ČUČNIK"},{"$f":"IF(COUNTIF(FinishedMatchStates,AJ6),1,0)+IF(L12=FinishedMatchStates,1,0)+IF(L18=FinishedMatchStates,1,0)+IF(L24=FinishedMatchStates,1,0)+IF(L30=FinishedMatchStates,1,0)+IF(L36=FinishedMatchStates,1,0)+IF(L42=FinishedMatchStates,1,0)","v":4},{"$f":"AJ4+L10+L17+L22+L29+L34+L41","v":13},{"$f":"AJ5+L11+L16+L23+L28+L35+L40","v":5},{"$f":"BE4-BF4","v":8},{"$f":"IF(COUNTIF(WinStates,AK4),1,0)+IF(COUNTIF(WinStates,M10),1,0)+IF(COUNTIF(WinStates,M17),1,0)+IF(COUNTIF(WinStates,M22),1,0)+IF(COUNTIF(WinStates,M29),1,0)+IF(COUNTIF(WinStates,M34),1,0)+IF(COUNTIF(WinStates,M41),1,0)","v":3},{"$f":"8-IF(BH4>=BH5,1,0)-IF(BH4>=BH6,1,0)-IF(BH4>=BH7,1,0)-IF(BH4>=BH8,1,0)-IF(BH4>=BH9,1,0)-IF(BH4>=BH10,1,0)-IF(BH4>=BH11,1,0)","v":2},2,null,null,null,{"$f":"BJ4","v":2},{"$f":"BC4","v":"Franci ČUČNIK"},{"$f":"IF(ISBLANK(BK4),\"\",BK4)","v":""},null,null,null,null,null,null,null,null,null,null,3,{"$f":"CB3","v":4},{"$f":"CC3+8","v":24},"$X$4",{"$f":"CONCATENATE($B$2)","v":"4"},3,"","09:00:00",5,"","11:11:00","11:12:00","00:01:00","Nino PORIČ",866,0,"WO","Lovro KOKOT",915,0,"DNS","F",true]
["Poz.","Tekmovalec",null,null,null,null,{"$f":"CELL(\"address\",OFFSET($A$5,L2,0))","v":"$A$12"},null,{"$f":"IF(G6=\"*\",IF(AND(OFFSET(INDIRECT(G5),0,0)>0,NOT(ISNA(OFFSET(INDIRECT(G5),0,1)))),OFFSET(INDIRECT(G5),0,1),UnsetMatchCompetitorText),IF(OFFSET(INDIRECT(G5),2,5)>0,IF(COUNTIF(INDIRECT(G6),(OFFSET(INDIRECT(G5),0,5)))>0,OFFSET(INDIRECT(G5),0,1),IF(COUNTIF(INDIRECT(G6),(OFFSET(INDIRECT(G5),1,5)))>0,OFFSET(INDIRECT(G5),1,1),BlankMatchCompetitorText)),AwaitingMatchCompetitorText))","v":""},null,null,null,null,{"$f":"IF(M5=NormalWinState,AND(M4=NormalLoseState,L5>L4),TRUE)","v":true},{"$f":"CELL(\"address\",OFFSET($A$5,T2,0))","v":"$A$11"},null,{"$f":"IF(O6=\"*\",IF(AND(OFFSET(INDIRECT(O5),0,0)>0,NOT(ISNA(OFFSET(INDIRECT(O5),0,1)))),OFFSET(INDIRECT(O5),0,1),UnsetMatchCompetitorText),IF(OFFSET(INDIRECT(O5),2,5)>0,IF(COUNTIF(INDIRECT(O6),(OFFSET(INDIRECT(O5),0,5)))>0,OFFSET(INDIRECT(O5),0,1),IF(COUNTIF(INDIRECT(O6),(OFFSET(INDIRECT(O5),1,5)))>0,OFFSET(INDIRECT(O5),1,1),BlankMatchCompetitorText)),AwaitingMatchCompetitorText))","v":"Tomaž BENEDIČIČ"},null,null,null,null,{"$f":"IF(U5=NormalWinState,AND(U4=NormalLoseState,T5>T4),TRUE)","v":true},{"$f":"CELL(\"address\",OFFSET($A$5,AB2,0))","v":"$A$10"},null,{"$f":"IF(W6=\"*\",IF(AND(OFFSET(INDIRECT(W5),0,0)>0,NOT(ISNA(OFFSET(INDIRECT(W5),0,1)))),OFFSET(INDIRECT(W5),0,1),UnsetMatchCompetitorText),IF(OFFSET(INDIRECT(W5),2,5)>0,IF(COUNTIF(INDIRECT(W6),(OFFSET(INDIRECT(W5),0,5)))>0,OFFSET(INDIRECT(W5),0,1),IF(COUNTIF(INDIRECT(W6),(OFFSET(INDIRECT(W5),1,5)))>0,OFFSET(INDIRECT(W5),1,1),BlankMatchCompetitorText)),AwaitingMatchCompetitorText))","v":"Lovro KOKOT"},null,null,null,"DNS",{"$f":"IF(AC5=NormalWinState,AND(AC4=NormalLoseState,AB5>AB4),TRUE)","v":true},{"$f":"CELL(\"address\",OFFSET($A$5,AJ2,0))","v":"$A$13"},null,{"$f":"IF(AE6=\"*\",IF(AND(OFFSET(INDIRECT(AE5),0,0)>0,NOT(ISNA(OFFSET(INDIRECT(AE5),0,1)))),OFFSET(INDIRECT(AE5),0,1),UnsetMatchCompetitorText),IF(OFFSET(INDIRECT(AE5),2,5)>0,IF(COUNTIF(INDIRECT(AE6),(OFFSET(INDIRECT(AE5),0,5)))>0,OFFSET(INDIRECT(AE5),0,1),IF(COUNTIF(INDIRECT(AE6),(OFFSET(INDIRECT(AE5),1,5)))>0,OFFSET(INDIRECT(AE5),1,1),BlankMatchCompetitorText)),AwaitingMatchCompetitorText))","v":"Sašo MEŽEK"},null,null,null,"DNS",{"$f":"IF(AK5=NormalWinState,AND(AK4=NormalLoseState,AJ5>AJ4),TRUE)","v":true},null,null,null,null,null,null,null,null,null,null,null,null,null,null,null,null,"",{"$f":"IF(L6=FinishedMatchStates,1,0)+IF(L12=FinishedMatchStates,1,0)+IF(AJ18=FinishedMatchStates,1,0)+IF(T24=FinishedMatchStates,1,0)+IF(T30=FinishedMatchStates,1,0)+IF(T36=FinishedMatchStates,1,0)+IF(T42=FinishedMatchStates,1,0)","v":0},{"$f":"L4+L11+AJ16+T22+T29+T34+T41","v":0},{"$f":"L5+L10+AJ17+T23+T28+T35+T40","v":0},0,{"$f":"IF(COUNTIF(WinStates,M4),1,0)+IF(COUNTIF(WinStates,M11),1,0)+IF(COUNTIF(WinStates,AK16),1,0)+IF(COUNTIF(WinStates,U22),1,0)+IF(COUNTIF(WinStates,U29),1,0)+IF(COUNTIF(WinStates,U34),1,0)+IF(COUNTIF(WinStates,U41),1,0)","v":0},{"$f":"8-IF(BH5>=BH4,1,0)-IF(BH5>=BH6,1,0)-IF(BH5>=BH7,1,0)-IF(BH5>=BH8,1,0)-IF(BH5>=BH9,1,0)-IF(BH5>=BH10,1,0)-IF(BH5>=BH11,1,0)","v":5},null,null,null,null,{"$f":"BJ5","v":0},{"$f":"BC5","v":""},"",null,null,null,null,null,null,null,null,null,null,4,{"$f":"CB4","v":4},{"$f":"CC4+8","v":32},"$AF$4",{"$f":"CONCATENATE($B$2)","v":"4"},4,"","09:00:00",5,"","10:22:00","10:23:00","00:01:00","Franci ČUČNIK",891,0,"WO","Sašo MEŽEK",689,0,"DNS","F",true]
[{"$f":"($B$2-1)*TournamentGroupSize+1","v":25},{"$f":"VLOOKUP(A6,DrawSheetPositionCompetitorsQualification,2,FALSE)","v":"Franci ČUČNIK"},null,null,null,null,"*",null,null,null,{"$f":"IF(ISBLANK(I6),\"\",IF(ISBLANK(J6),CurrentTime-I6,J6-I6))","v":""},null,{"$f":"IF(AND(COUNTIF(FinishedMatchStates,L6),NOT(ISNA(VLOOKUP(M4,MatchCompetitorStateCodes,1,FALSE))),NOT(ISNA(VLOOKUP(M5,MatchCompetitorStateCodes,1,FALSE))),COUNTIF(WinStates,M4)+COUNTIF(WinStates,M5)<=1,COUNTIF(LoseStates,M4)+COUNTIF(LoseStates,M5)<=1,IF(M4=NormalWinState,AND(M5=NormalLoseState,L4>L5),TRUE),IF(M5=NormalWinState,AND(M4=NormalLoseState,L5>L4),TRUE),NOT(ISBLANK(L3)),NOT(ISBLANK(I3)),NOT(ISBLANK(I6)),NOT(ISBLANK(J6)),H3>0),1,IF(COUNTIF(FinishedMatchStates,L6)>0,-1,0))","v":0},null,"*",null,null,null,{"$f":"IF(ISBLANK(Q6),\"\",IF(ISBLANK(R6),CurrentTime-Q6,R6-Q6))","v":""},null,{"$f":"IF(AND(COUNTIF(FinishedMatchStates,T6),NOT(ISNA(VLOOKUP(U4,MatchCompetitorStateCodes,1,FALSE))),NOT(ISNA(VLOOKUP(U5,MatchCompetitorStateCodes,1,FALSE))),COUNTIF(WinStates,U4)+COUNTIF(WinStates,U5)<=1,COUNTIF(LoseStates,U4)+COUNTIF(LoseStates,U5)<=1,IF(U4=NormalWinState,AND(U5=NormalLoseState,T4>T5),TRUE),IF(U5=NormalWinState,AND(U4=NormalLoseState,T5>T4),TRUE),NOT(ISBLANK(T3)),NOT(ISBLANK(Q3)),NOT(ISBLANK(Q6)),NOT(ISBLANK(R6)),P3>0),1,IF(COUNTIF(FinishedMatchStates,T6)>0,-1,0))","v":0},null,"*",null,"11:11:00","11:12:00",{"$f":"IF(ISBLANK(Y6),\"\",IF(ISBLANK(Z6),CurrentTime-Y6,Z6-Y6))","v":"00:01:00"},"F",{"$f":"IF(AND(COUNTIF(FinishedMatchStates,AB6),NOT(ISNA(VLOOKUP(AC4,MatchCompetitorStateCodes,1,FALSE))),NOT(ISNA(VLOOKUP(AC5,MatchCompetitorStateCodes,1,FALSE))),COUNTIF(WinStates,AC4)+COUNTIF(WinStates,AC5)<=1,COUNTIF(LoseStates,AC4)+COUNTIF(LoseStates,AC5)<=1,IF(AC4=NormalWinState,AND(AC5=NormalLoseState,AB4>AB5),TRUE),IF(AC5=NormalWinState,AND(AC4=NormalLoseState,AB5>AB4),TRUE),NOT(ISBLANK(AB3)),NOT(ISBLANK(Y3)),NOT(ISBLANK(Y6)),NOT(ISBLANK(Z6)),X3>0),1,IF(COUNTIF(FinishedMatchStates,AB6)>0,-1,0))","v":1},null,"*",null,"10:22:00","10:23:00",{"$f":"IF(ISBLANK(AG6),\"\",IF(ISBLANK(AH6),CurrentTime-AG6,AH6-AG6))","v":"00:01:00"},"F",{"$f":"IF(AND(COUNTIF(FinishedMatchStates,AJ6),NOT(ISNA(VLOOKUP(AK4,MatchCompetitorStateCodes,1,FALSE))),NOT(ISNA(VLOOKUP(AK5,MatchCompetitorStateCodes,1,FALSE))),COUNTIF(WinStates,AK4)+COUNTIF(WinStates,AK5)<=1,COUNTIF(LoseStates,AK4)+COUNTIF(LoseStates,AK5)<=1,IF(AK4=NormalWinState,AND(AK5=NormalLoseState,AJ4>AJ5),TRUE),IF(AK5=NormalWinState,AND(AK4=NormalLoseState,AJ5>AJ4),TRUE),NOT(ISBLANK(AJ3)),NOT(ISBLANK(AG3)),NOT(ISBLANK(AG6)),NOT(ISBLANK(AH6)),AF3>0),1,IF(COUNTIF(FinishedMatchStates,AJ6)>0,-1,0))","v":1},null,null,null,null,null,null,null,null,null,null,null,null,null,null,null,null,null,"",{"$f":"IF(T6=FinishedMatchStates,1,0)+IF(T12=FinishedMatchStates,1,0)+IF(L18=FinishedMatchStates,1,0)+IF(T24=FinishedMatchStates,1,0)+IF(AJ30=FinishedMatchStates,1,0)+IF(AB36=FinishedMatchStates,1,0)+IF(AB42=FinishedMatchStates,1,0)","v":0},{"$f":"T4+T11+L16+T23+AJ28+AB34+AB41","v":0},{"$f":"T5+T10+L17+T22+AJ29+AB35+AB40","v":0},0,{"$f":"IF(COUNTIF(WinStates,U4),1,0)+IF(COUNTIF(WinStates,U11),1,0)+IF(COUNTIF(WinStates,M16),1,0)+IF(COUNTIF(WinStates,U23),1,0)+IF(COUNTIF(WinStates,AK28),1,0)+IF(COUNTIF(WinStates,AC34),1,0)+IF(COUNTIF(WinStates,AC41),1,0)","v":0},{"$f":"8-IF(BH6>=BH5,1,0)-IF(BH6>=BH4,1,0)-IF(BH6>=BH7,1,0)-IF(BH6>=BH8,1,0)-IF(BH6>=BH9,1,0)-IF(BH6>=BH10,1,0)-IF(BH6>=BH11,1,0)","v":5},null,null,null,null,0,"",{"$f":"IF(ISBLANK(BK6),\"\",BK6)","v":""},null,null,null,null,null,null,null,null,null,null,5,{"$f":"CB2+6","v":10},{"$f":"CC2","v":8},"$H$10",{"$f":"CONCATENATE($B$2)","v":"4"},5,"","09:00:00",0,"","00:00:00","00:00:00","","Franci ČUČNIK",891,0,0,"",0,0,0,0,false]
[{"$f":"A6+1","v":26},"",null,null,null,null,null,null,null,null,null,null,null,null,null,null,null,null,null,null,null,null,null,null,null,null,null,null,null,null,null,null,null,null,null,null,null,null,null,null,null,null,null,null,null,null,null,null,null,null,null,null,null,null,"Nino PORIČ",{"$f":"IF(AB6=FinishedMatchStates,1,0)+IF(AB12=FinishedMatchStates,1,0)+IF(T18=FinishedMatchStates,1,0)+IF(L24=FinishedMatchStates,1,0)+IF(T30=FinishedMatchStates,1,0)+IF(AB36=FinishedMatchStates,1,0)+IF(AJ42=FinishedMatchStates,1,0)","v":4},{"$f":"AB4+AB11+T16+L23+T28+AB35+AJ40","v":10},{"$f":"AB5+AB10+T17+L22+T29+AB34+AJ41","v":3},7,{"$f":"IF(COUNTIF(WinStates,AC4),1,0)+IF(COUNTIF(WinStates,AC11),1,0)+IF(COUNTIF(WinStates,U16),1,0)+IF(COUNTIF(WinStates,M23),1,0)+IF(COUNTIF(WinStates,U28),1,0)+IF(COUNTIF(WinStates,AC35),1,0)+IF(COUNTIF(WinStates,AK40),1,0)","v":4},{"$f":"8-IF(BH7>=BH5,1,0)-IF(BH7>=BH6,1,0)-IF(BH7>=BH4,1,0)-IF(BH7>=BH8,1,0)-IF(BH7>=BH9,1,0)-IF(BH7>=BH10,1,0)-IF(BH7>=BH11,1,0)","v":1},1,null,null,null,1,"Nino PORIČ",{"$f":"IF(ISBLANK(BK7),\"\",BK7)","v":""},null,null,null,null,null,null,null,null,null,null,6,{"$f":"CB6","v":10},{"$f":"CC6+8","v":16},"$P$10",{"$f":"CONCATENATE($B$2)","v":"4"},6,"","09:00:00",0,"","00:00:00","00:00:00","","",0,0,0,"",0,0,0,0,false]
[{"$f":"A7+1","v":27},"",null,null,null,null,{"$f":"G2","v":1},{"$f":"H2+1","v":2},{"$f":"I2","v":1},{"$f":"((H8-1)*$B$3)+I8","v":5},1,2,null,null,{"$f":"G8","v":1},{"$f":"H8","v":2},{"$f":"I8+1","v":2},{"$f":"((P8-1)*$B$3)+Q8","v":6},7,3,null,null,{"$f":"O8","v":1},{"$f":"P8","v":2},{"$f":"Q8+1","v":3},{"$f":"((X8-1)*$B$3)+Y8","v":7},6,4,null,null,{"$f":"W8","v":1},{"$f":"X8","v":2},{"$f":"Y8+1","v":4},{"$f":"((AF8-1)*$B$3)+AG8","v":8},8,5,null,null,null,null,null,null,null,null,null,null,null,null,null,null,null,null,null,null,"Lovro KOKOT",{"$f":"IF(AB6=FinishedMatchStates,1,0)+IF(AJ12=FinishedMatchStates,1,0)+IF(AB18=FinishedMatchStates,1,0)+IF(AB24=FinishedMatchStates,1,0)+IF(L30=FinishedMatchStates,1,0)+IF(T36=FinishedMatchStates,1,0)+IF(AB42=FinishedMatchStates,1,0)","v":4},{"$f":"AB5+AJ11+AB16+AB23+L28+T35+AB40","v":1},{"$f":"AB4+AJ10+AB17+AB22+L29+T34+AB41","v":10},-9,{"$f":"IF(COUNTIF(WinStates,AC5),1,0)+IF(COUNTIF(WinStates,AK11),1,0)+IF(COUNTIF(WinStates,AC16),1,0)+IF(COUNTIF(WinStates,AC23),1,0)+IF(COUNTIF(WinStates,M28),1,0)+IF(COUNTIF(WinStates,U35),1,0)+IF(COUNTIF(WinStates,AC40),1,0)","v":1},{"$f":"8-IF(BH8>=BH5,1,0)-IF(BH8>=BH6,1,0)-IF(BH8>=BH7,1,0)-IF(BH8>=BH4,1,0)-IF(BH8>=BH9,1,0)-IF(BH8>=BH10,1,0)-IF(BH8>=BH11,1,0)","v":4},null,null,null,null,0,"Lovro KOKOT","",null,null,null,null,null,null,null,null,null,null,7,{"$f":"CB7","v":10},{"$f":"CC7+8","v":24},"$X$10",{"$f":"CONCATENATE($B$2)","v":"4"},7,"7","09:00:00",5,"","10:48:00","11:23:00","00:35:00","Tomaž BENEDIČIČ",1,0,"L","Nino PORIČ",866,5,"W","F",true]
[28,"Nino PORIČ",null,null,null,null,{"$f":"CELL(\"address\",OFFSET($A$5,K8,0))","v":"$A$6"},{"$f":"IF(AND(NOT(ISBLANK(I10)),I10<>UnsetMatchCompetitorText,I10<>AwaitingMatchCompetitorText,NOT(ISBLANK(I11)),I11<>UnsetMatchCompetitorText,I11<>AwaitingMatchCompetitorText),1,IF(AND(I10<>AwaitingMatchCompetitorText,I11<>AwaitingMatchCompetitorText),-1,0))","v":1},"09:00:00",null,null,null,null,null,{"$f":"CELL(\"address\",OFFSET($A$5,S8,0))","v":"$A$12"},{"$f":"IF(AND(NOT(ISBLANK(Q10)),Q10<>UnsetMatchCompetitorText,Q10<>AwaitingMatchCompetitorText,NOT(ISBLANK(Q11)),Q11<>UnsetMatchCompetitorText,Q11<>AwaitingMatchCompetitorText),1,IF(AND(Q10<>AwaitingMatchCompetitorText,Q11<>AwaitingMatchCompetitorText),-1,0))","v":1},"09:00:00",null,null,null,null,null,{"$f":"CELL(\"address\",OFFSET($A$5,AA8,0))","v":"$A$11"},{"$f":"IF(AND(NOT(ISBLANK(Y10)),Y10<>UnsetMatchCompetitorText,Y10<>AwaitingMatchCompetitorText,NOT(ISBLANK(Y11)),Y11<>UnsetMatchCompetitorText,Y11<>AwaitingMatchCompetitorText),1,IF(AND(Y10<>AwaitingMatchCompetitorText,Y11<>AwaitingMatchCompetitorText),-1,0))","v":1},"09:00:00",null,null,5,null,null,{"$f":"CELL(\"address\",OFFSET($A$5,AI8,0))","v":"$A$13"},{"$f":"IF(AND(NOT(ISBLANK(AG10)),AG10<>UnsetMatchCompetitorText,AG10<>AwaitingMatchCompetitorText,NOT(ISBLANK(AG11)),AG11<>UnsetMatchCompetitorText,AG11<>AwaitingMatchCompetitorText),1,IF(AND(AG10<>AwaitingMatchCompetitorText,AG11<>AwaitingMatchCompetitorText),-1,0))","v":1},"09:00:00",null,null,5,null,null,null,null,null,null,null,null,null,null,null,null,null,null,null,null,null,null,"Tomaž BENEDIČIČ",{"$f":"IF(T6=FinishedMatchStates,1,0)+IF(AB12=FinishedMatchStates,1,0)+IF(AB18=FinishedMatchStates,1,0)+IF(AJ24=FinishedMatchStates,1,0)+IF(AB30=FinishedMatchStates,1,0)+IF(L36=FinishedMatchStates,1,0)+IF(T42=FinishedMatchStates,1,0)","v":4},{"$f":"T5+AB10+AB17+AJ23+AB28+L35+T40","v":5},{"$f":"T4+AB11+AB16+AJ22+AB29+L34+T41","v":11},-6,{"$f":"IF(COUNTIF(WinStates,U5),1,0)+IF(COUNTIF(WinStates,AC10),1,0)+IF(COUNTIF(WinStates,AC17),1,0)+IF(COUNTIF(WinStates,AK23),1,0)+IF(COUNTIF(WinStates,AC28),1,0)+IF(COUNTIF(WinStates,M35),1,0)+IF(COUNTIF(WinStates,U40),1,0)","v":2},{"$f":"8-IF(BH9>=BH5,1,0)-IF(BH9>=BH6,1,0)-IF(BH9>=BH7,1,0)-IF(BH9>=BH8,1,0)-IF(BH9>=BH4,1,0)-IF(BH9>=BH10,1,0)-IF(BH9>=BH11,1,0)","v":3},null,null,null,null,0,"Tomaž BENEDIČIČ","",null,null,null,null,null,null,null,null,null,null,8,{"$f":"CB8","v":10},{"$f":"CC8+8","v":32},"$AF$10",{"$f":"CONCATENATE($B$2)","v":"4"},8,"","09:00:00",5,"","10:22:00","10:23:00","00:01:00","Sašo MEŽEK",689,0,"DNS","Lovro KOKOT",915,0,"WO","F",true]
[29,"Lovro KOKOT",null,null,null,null,"*",{"$f":"J8","v":5},{"$f":"IF(G10=\"*\",IF(AND(OFFSET(INDIRECT(G9),0,0)>0,NOT(ISNA(OFFSET(INDIRECT(G9),0,1)))),OFFSET(INDIRECT(G9),0,1),UnsetMatchCompetitorText),IF(OFFSET(INDIRECT(G9),2,5)>0,IF(COUNTIF(INDIRECT(G10),(OFFSET(INDIRECT(G9),0,5)))>0,OFFSET(INDIRECT(G9),0,1),IF(COUNTIF(INDIRECT(G10),(OFFSET(INDIRECT(G9),1,5)))>0,OFFSET(INDIRECT(G9),1,1),BlankMatchCompetitorText)),AwaitingMatchCompetitorText))","v":"Franci ČUČNIK"},null,null,null,null,{"$f":"IF(M10=NormalWinState,AND(M11=NormalLoseState,L10>L11),TRUE)","v":true},"*",{"$f":"R8","v":6},{"$f":"IF(O10=\"*\",IF(AND(OFFSET(INDIRECT(O9),0,0)>0,NOT(ISNA(OFFSET(INDIRECT(O9),0,1)))),OFFSET(INDIRECT(O9),0,1),UnsetMatchCompetitorText),IF(OFFSET(INDIRECT(O9),2,5)>0,IF(COUNTIF(INDIRECT(O10),(OFFSET(INDIRECT(O9),0,5)))>0,OFFSET(INDIRECT(O9),0,1),IF(COUNTIF(INDIRECT(O10),(OFFSET(INDIRECT(O9),1,5)))>0,OFFSET(INDIRECT(O9),1,1),BlankMatchCompetitorText)),AwaitingMatchCompetitorText))","v":""},null,null,null,null,{"$f":"IF(U10=NormalWinState,AND(U11=NormalLoseState,T10>T11),TRUE)","v":true},"*",{"$f":"Z8","v":7},{"$f":"IF(W10=\"*\",IF(AND(OFFSET(INDIRECT(W9),0,0)>0,NOT(ISNA(OFFSET(INDIRECT(W9),0,1)))),OFFSET(INDIRECT(W9),0,1),UnsetMatchCompetitorText),IF(OFFSET(INDIRECT(W9),2,5)>0,IF(COUNTIF(INDIRECT(W10),(OFFSET(INDIRECT(W9),0,5)))>0,OFFSET(INDIRECT(W9),0,1),IF(COUNTIF(INDIRECT(W10),(OFFSET(INDIRECT(W9),1,5)))>0,OFFSET(INDIRECT(W9),1,1),BlankMatchCompetitorText)),AwaitingMatchCompetitorText))","v":"Tomaž BENEDIČIČ"},null,null,0,"L",{"$f":"IF(AC10=NormalWinState,AND(AC11=NormalLoseState,AB10>AB11),TRUE)","v":true},"*",{"$f":"AH8","v":8},{"$f":"IF(AE10=\"*\",IF(AND(OFFSET(INDIRECT(AE9),0,0)>0,NOT(ISNA(OFFSET(INDIRECT(AE9),0,1)))),OFFSET(INDIRECT(AE9),0,1),UnsetMatchCompetitorText),IF(OFFSET(INDIRECT(AE9),2,5)>0,IF(COUNTIF(INDIRECT(AE10),(OFFSET(INDIRECT(AE9),0,5)))>0,OFFSET(INDIRECT(AE9),0,1),IF(COUNTIF(INDIRECT(AE10),(OFFSET(INDIRECT(AE9),1,5)))>0,OFFSET(INDIRECT(AE9),1,1),BlankMatchCompetitorText)),AwaitingMatchCompetitorText))","v":"Sašo MEŽEK"},null,null,null,"DNS",{"$f":"IF(AK10=NormalWinState,AND(AK11=NormalLoseState,AJ10>AJ11),TRUE)","v":true},null,null,null,null,null,null,null,null,null,null,null,null,null,null,null,null,"",{"$f":"IF(L6=FinishedMatchStates,1,0)+IF(T12=FinishedMatchStates,1,0)+IF(T18=FinishedMatchStates,1,0)+IF(AB24=FinishedMatchStates,1,0)+IF(AB30=FinishedMatchStates,1,0)+IF(AJ36=FinishedMatchStates,1,0)+IF(L42=FinishedMatchStates,1,0)","v":0},{"$f":"L5+T10+T17+AB22+AB29+AJ35+L40","v":0},{"$f":"L4+T11+T16+AB23+AB28+AJ34+L41","v":0},{"$f":"BE10-BF10","v":0},{"$f":"IF(COUNTIF(WinStates,M5),1,0)+IF(COUNTIF(WinStates,U10),1,0)+IF(COUNTIF(WinStates,U17),1,0)+IF(COUNTIF(WinStates,AC22),1,0)+IF(COUNTIF(WinStates,AC29),1,0)+IF(COUNTIF(WinStates,AK35),1,0)+IF(COUNTIF(WinStates,M40),1,0)","v":0},{"$f":"8-IF(BH10>=BH6,1,0)-IF(BH10>=BH7,1,0)-IF(BH10>=BH8,1,0)-IF(BH10>=BH9,1,0)-IF(BH10>=BH5,1,0)-IF(BH10>=BH11,1,0)-IF(BH10>=BH4,1,0)","v":5},null,null,null,null,0,"","",null,null,null,null,null,null,null,null,null,null,9,{"$f":"CB6+6","v":16},{"$f":"CC6","v":8},"$H$16","4",9,"","09:00:00",0,"","00:00:00","00:00:00","","",0,0,0,"Franci ČUČNIK",891,0,0,0,false]
[30,"Tomaž BENEDIČIČ",null,null,null,null,{"$f":"CELL(\"address\",OFFSET($A$5,L8,0))","v":"$A$7"},null,{"$f":"IF(G12=\"*\",IF(AND(OFFSET(INDIRECT(G11),0,0)>0,NOT(ISNA(OFFSET(INDIRECT(G11),0,1)))),OFFSET(INDIRECT(G11),0,1),UnsetMatchCompetitorText),IF(OFFSET(INDIRECT(G11),2,5)>0,IF(COUNTIF(INDIRECT(G12),(OFFSET(INDIRECT(G11),0,5)))>0,OFFSET(INDIRECT(G11),0,1),IF(COUNTIF(INDIRECT(G12),(OFFSET(INDIRECT(G11),1,5)))>0,OFFSET(INDIRECT(G11),1,1),BlankMatchCompetitorText)),AwaitingMatchCompetitorText))","v":""},null,null,null,null,{"$f":"IF(M11=NormalWinState,AND(M10=NormalLoseState,L11>L10),TRUE)","v":true},{"$f":"CELL(\"address\",OFFSET($A$5,T8,0))","v":"$A$8"},null,{"$f":"IF(O12=\"*\",IF(AND(OFFSET(INDIRECT(O11),0,0)>0,NOT(ISNA(OFFSET(INDIRECT(O11),0,1)))),OFFSET(INDIRECT(O11),0,1),UnsetMatchCompetitorText),IF(OFFSET(INDIRECT(O11),2,5)>0,IF(COUNTIF(INDIRECT(O12),(OFFSET(INDIRECT(O11),0,5)))>0,OFFSET(INDIRECT(O11),0,1),IF(COUNTIF(INDIRECT(O12),(OFFSET(INDIRECT(O11),1,5)))>0,OFFSET(INDIRECT(O11),1,1),BlankMatchCompetitorText)),AwaitingMatchCompetitorText))","v":""},null,null,null,null,{"$f":"IF(U11=NormalWinState,AND(U10=NormalLoseState,T11>T10),TRUE)","v":true},{"$f":"CELL(\"address\",OFFSET($A$5,AB8,0))","v":"$A$9"},null,{"$f":"IF(W12=\"*\",IF(AND(OFFSET(INDIRECT(W11),0,0)>0,NOT(ISNA(OFFSET(INDIRECT(W11),0,1)))),OFFSET(INDIRECT(W11),0,1),UnsetMatchCompetitorText),IF(OFFSET(INDIRECT(W11),2,5)>0,IF(COUNTIF(INDIRECT(W12),(OFFSET(INDIRECT(W11),0,5)))>0,OFFSET(INDIRECT(W11),0,1),IF(COUNTIF(INDIRECT(W12),(OFFSET(INDIRECT(W11),1,5)))>0,OFFSET(INDIRECT(W11),1,1),BlankMatchCompetitorText)),AwaitingMatchCompetitorText))","v":"Nino PORIČ"},null,null,5,"W",{"$f":"IF(AC11=NormalWinState,AND(AC10=NormalLoseState,AB11>AB10),TRUE)","v":true},{"$f":"CELL(\"address\",OFFSET($A$5,AJ8,0))","v":"$A$10"},null,{"$f":"IF(AE12=\"*\",IF(AND(OFFSET(INDIRECT(AE11),0,0)>0,NOT(ISNA(OFFSET(INDIRECT(AE11),0,1)))),OFFSET(INDIRECT(AE11),0,1),UnsetMatchCompetitorText),IF(OFFSET(INDIRECT(AE11),2,5)>0,IF(COUNTIF(INDIRECT(AE12),(OFFSET(INDIRECT(AE11),0,5)))>0,OFFSET(INDIRECT(AE11),0,1),IF(COUNTIF(INDIRECT(AE12),(OFFSET(INDIRECT(AE11),1,5)))>0,OFFSET(INDIRECT(AE11),1,1),BlankMatchCompetitorText)),AwaitingMatchCompetitorText))","v":"Lovro KOKOT"},null,null,null,"WO",{"$f":"IF(AK11=NormalWinState,AND(AK10=NormalLoseState,AJ11>AJ10),TRUE)","v":true},null,null,null,null,null,null,null,null,null,null,null,null,null,null,null,null,"Sašo MEŽEK",{"$f":"IF(AJ6=FinishedMatchStates,1,0)+IF(AJ12=FinishedMatchStates,1,0)+IF(AJ18=FinishedMatchStates,1,0)+IF(AJ24=FinishedMatchStates,1,0)+IF(AJ30=FinishedMatchStates,1,0)+IF(AJ36=FinishedMatchStates,1,0)+IF(AJ42=FinishedMatchStates,1,0)","v":4},{"$f":"AJ5+AJ10+AJ17+AJ22+AJ29+AJ34+AJ41","v":0},{"$f":"AJ4+AJ11+AJ16+AJ23+AJ28+AJ35+AJ40","v":0},{"$f":"BE11-BF11","v":0},{"$f":"IF(COUNTIF(WinStates,AK5),1,0)+IF(COUNTIF(WinStates,AK10),1,0)+IF(COUNTIF(WinStates,AK17),1,0)+IF(COUNTIF(WinStates,AK22),1,0)+IF(COUNTIF(WinStates,AK29),1,0)+IF(COUNTIF(WinStates,AK34),1,0)+IF(COUNTIF(WinStates,AK41),1,0)","v":0},{"$f":"8-IF(BH11>=BH7,1,0)-IF(BH11>=BH8,1,0)-IF(BH11>=BH9,1,0)-IF(BH11>=BH10,1,0)-IF(BH11>=BH6,1,0)-IF(BH11>=BH4,1,0)-IF(BH11>=BH5,1,0)","v":5},null,null,null,null,0,"Sašo MEŽEK","",null,null,null,null,null,null,null,null,null,null,10,{"$f":"CB10","v":16},{"$f":"CC10+8","v":16},"$P$16",{"$f":"CONCATENATE($B$2)","v":"4"},10,"","09:00:00",0,"","00:00:00","00:00:00","","Nino PORIČ",866,0,0,"",0,0,0,0,false]
[31,"",null,null,null,null,"*",null,null,null,{"$f":"IF(ISBLANK(I12),\"\",IF(ISBLANK(J12),CurrentTime-I12,J12-I12))","v":""},null,{"$f":"IF(AND(COUNTIF(FinishedMatchStates,L12),NOT(ISNA(VLOOKUP(M10,MatchCompetitorStateCodes,1,FALSE))),NOT(ISNA(VLOOKUP(M11,MatchCompetitorStateCodes,1,FALSE))),COUNTIF(WinStates,M10)+COUNTIF(WinStates,M11)<=1,COUNTIF(LoseStates,M10)+COUNTIF(LoseStates,M11)<=1,IF(M10=NormalWinState,AND(M11=NormalLoseState,L10>L11),TRUE),IF(M11=NormalWinState,AND(M10=NormalLoseState,L11>L10),TRUE),NOT(ISBLANK(L9)),NOT(ISBLANK(I9)),NOT(ISBLANK(I12)),NOT(ISBLANK(J12)),H9>0),1,IF(COUNTIF(FinishedMatchStates,L12)>0,-1,0))","v":0},null,"*",null,null,null,{"$f":"IF(ISBLANK(Q12),\"\",IF(ISBLANK(R12),CurrentTime-Q12,R12-Q12))","v":""},null,{"$f":"IF(AND(COUNTIF(FinishedMatchStates,T12),NOT(ISNA(VLOOKUP(U10,MatchCompetitorStateCodes,1,FALSE))),NOT(ISNA(VLOOKUP(U11,MatchCompetitorStateCodes,1,FALSE))),COUNTIF(WinStates,U10)+COUNTIF(WinStates,U11)<=1,COUNTIF(LoseStates,U10)+COUNTIF(LoseStates,U11)<=1,IF(U10=NormalWinState,AND(U11=NormalLoseState,T10>T11),TRUE),IF(U11=NormalWinState,AND(U10=NormalLoseState,T11>T10),TRUE),NOT(ISBLANK(T9)),NOT(ISBLANK(Q9)),NOT(ISBLANK(Q12)),NOT(ISBLANK(R12)),P9>0),1,IF(COUNTIF(FinishedMatchStates,T12)>0,-1,0))","v":0},null,"*",7,"10:48:00","11:23:00",{"$f":"IF(ISBLANK(Y12),\"\",IF(ISBLANK(Z12),CurrentTime-Y12,Z12-Y12))","v":"00:35:00"},"F",{"$f":"IF(AND(COUNTIF(FinishedMatchStates,AB12),NOT(ISNA(VLOOKUP(AC10,MatchCompetitorStateCodes,1,FALSE))),NOT(ISNA(VLOOKUP(AC11,MatchCompetitorStateCodes,1,FALSE))),COUNTIF(WinStates,AC10)+COUNTIF(WinStates,AC11)<=1,COUNTIF(LoseStates,AC10)+COUNTIF(LoseStates,AC11)<=1,IF(AC10=NormalWinState,AND(AC11=NormalLoseState,AB10>AB11),TRUE),IF(AC11=NormalWinState,AND(AC10=NormalLoseState,AB11>AB10),TRUE),NOT(ISBLANK(AB9)),NOT(ISBLANK(Y9)),NOT(ISBLANK(Y12)),NOT(ISBLANK(Z12)),X9>0),1,IF(COUNTIF(FinishedMatchStates,AB12)>0,-1,0))","v":1},null,"*",null,"10:22:00","10:23:00",{"$f":"IF(ISBLANK(AG12),\"\",IF(ISBLANK(AH12),CurrentTime-AG12,AH12-AG12))","v":"00:01:00"},"F",{"$f":"IF(AND(COUNTIF(FinishedMatchStates,AJ12),NOT(ISNA(VLOOKUP(AK10,MatchCompetitorStateCodes,1,FALSE))),NOT(ISNA(VLOOKUP(AK11,MatchCompetitorStateCodes,1,FALSE))),COUNTIF(WinStates,AK10)+COUNTIF(WinStates,AK11)<=1,COUNTIF(LoseStates,AK10)+COUNTIF(LoseStates,AK11)<=1,IF(AK10=NormalWinState,AND(AK11=NormalLoseState,AJ10>AJ11),TRUE),IF(AK11=NormalWinState,AND(AK10=NormalLoseState,AJ11>AJ10),TRUE),NOT(ISBLANK(AJ9)),NOT(ISBLANK(AG9)),NOT(ISBLANK(AG12)),NOT(ISBLANK(AH12)),AF9>0),1,IF(COUNTIF(FinishedMatchStates,AJ12)>0,-1,0))","v":1},null,null,null,null,null,null,null,null,null,null,null,null,null,null,null,null,null,null,null,null,null,null,null,null,null,null,null,null,null,null,null,null,null,null,null,null,null,null,null,null,null,11,{"$f":"CB11","v":16},{"$f":"CC11+8","v":24},"$X$16",{"$f":"CONCATENATE($B$2)","v":"4"},11,"8","09:00:00",5,"","09:15:00","09:53:00","00:38:00","Lovro KOKOT",915,1,"L","Tomaž BENEDIČIČ",1,5,"W","F",true]
[32,"Sašo MEŽEK",null,null,null,null,null,null,null,null,null,null,null,null,null,null,null,null,null,null,null,null,null,null,null,null,null,null,null,null,null,null,null,null,null,null,null,null,null,null,null,null,null,null,null,null,null,null,null,null,null,null,null,null,null,null,null,null,null,null,null,null,null,null,null,null,null,null,null,null,null,null,null,null,null,null,null,null,12,{"$f":"CB12","v":16},{"$f":"CC12+8","v":32},"$AF$16",{"$f":"CONCATENATE($B$2)","v":"4"},12,"","09:00:00",0,"","00:00:00","00:00:00","","",0,0,0,"Sašo MEŽEK",689,0,0,0,false]
[null,null,null,null,null,null,{"$f":"G8","v":1},{"$f":"H8+1","v":3},{"$f":"I8","v":1},{"$f":"((H14-1)*$B$3)+I14","v":9},3,1,null,null,{"$f":"G14","v":1},{"$f":"H14","v":3},{"$f":"I14+1","v":2},{"$f":"((P14-1)*$B$3)+Q14","v":10},4,7,null,null,{"$f":"O14","v":1},{"$f":"P14","v":3},{"$f":"Q14+1","v":3},{"$f":"((X14-1)*$B$3)+Y14","v":11},5,6,null,null,{"$f":"W14","v":1},{"$f":"X14","v":3},{"$f":"Y14+1","v":4},{"$f":"((AF14-1)*$B$3)+AG14","v":12},2,8,null,null,null,null,null,null,null,null,null,null,null,null,null,null,null,null,null,null,null,null,null,null,null,null,null,null,null,null,null,null,null,null,null,null,null,null,null,null,null,null,null,null,13,{"$f":"CB10+6","v":22},{"$f":"CC10","v":8},"$H$22","4",13,"7","09:00:00",5,"","09:17:00","10:44:00","01:27:00","Franci ČUČNIK",891,3,"L","Nino PORIČ",866,5,"W","F",true]
["Uvr.","Tekmovalec","Poz.","L","S",null,{"$f":"CELL(\"address\",OFFSET($A$5,K14,0))","v":"$A$8"},{"$f":"IF(AND(NOT(ISBLANK(I16)),I16<>UnsetMatchCompetitorText,I16<>AwaitingMatchCompetitorText,NOT(ISBLANK(I17)),I17<>UnsetMatchCompetitorText,I17<>AwaitingMatchCompetitorText),1,IF(AND(I16<>AwaitingMatchCompetitorText,I17<>AwaitingMatchCompetitorText),-1,0))","v":1},"09:00:00",null,null,null,null,null,{"$f":"CELL(\"address\",OFFSET($A$5,S14,0))","v":"$A$9"},{"$f":"IF(AND(NOT(ISBLANK(Q16)),Q16<>UnsetMatchCompetitorText,Q16<>AwaitingMatchCompetitorText,NOT(ISBLANK(Q17)),Q17<>UnsetMatchCompetitorText,Q17<>AwaitingMatchCompetitorText),1,IF(AND(Q16<>AwaitingMatchCompetitorText,Q17<>AwaitingMatchCompetitorText),-1,0))","v":1},"09:00:00",null,null,null,null,null,{"$f":"CELL(\"address\",OFFSET($A$5,AA14,0))","v":"$A$10"},{"$f":"IF(AND(NOT(ISBLANK(Y16)),Y16<>UnsetMatchCompetitorText,Y16<>AwaitingMatchCompetitorText,NOT(ISBLANK(Y17)),Y17<>UnsetMatchCompetitorText,Y17<>AwaitingMatchCompetitorText),1,IF(AND(Y16<>AwaitingMatchCompetitorText,Y17<>AwaitingMatchCompetitorText),-1,0))","v":1},"09:00:00",null,null,5,null,null,{"$f":"CELL(\"address\",OFFSET($A$5,AI14,0))","v":"$A$7"},{"$f":"IF(AND(NOT(ISBLANK(AG16)),AG16<>UnsetMatchCompetitorText,AG16<>AwaitingMatchCompetitorText,NOT(ISBLANK(AG17)),AG17<>UnsetMatchCompetitorText,AG17<>AwaitingMatchCompetitorText),1,IF(AND(AG16<>AwaitingMatchCompetitorText,AG17<>AwaitingMatchCompetitorText),-1,0))","v":1},"09:00:00",null,null,null,null,null,null,null,null,null,null,null,null,null,null,null,null,null,null,null,null,null,null,null,null,null,null,null,null,null,null,null,null,null,null,null,null,null,null,null,null,null,null,null,null,null,14,{"$f":"CB14","v":22},{"$f":"CC14+8","v":16},"$P$22",{"$f":"CONCATENATE($B$2)","v":"4"},14,"","09:00:00",0,"","00:00:00","00:00:00","","",0,0,0,"",0,0,0,0,false]
["Q",{"$f":"VLOOKUP(D16,BN$4:BP$11,2,)","v":"Nino PORIČ"},{"$f":"VLOOKUP(D16,BN$4:BP$11,3,)","v":""},1,null,null,"*",{"$f":"J14","v":9},{"$f":"IF(G16=\"*\",IF(AND(OFFSET(INDIRECT(G15),0,0)>0,NOT(ISNA(OFFSET(INDIRECT(G15),0,1)))),OFFSET(INDIRECT(G15),0,1),UnsetMatchCompetitorText),IF(OFFSET(INDIRECT(G15),2,5)>0,IF(COUNTIF(INDIRECT(G16),(OFFSET(INDIRECT(G15),0,5)))>0,OFFSET(INDIRECT(G15),0,1),IF(COUNTIF(INDIRECT(G16),(OFFSET(INDIRECT(G15),1,5)))>0,OFFSET(INDIRECT(G15),1,1),BlankMatchCompetitorText)),AwaitingMatchCompetitorText))","v":""},null,null,null,null,{"$f":"IF(M16=NormalWinState,AND(M17=NormalLoseState,L16>L17),TRUE)","v":true},"*",{"$f":"R14","v":10},{"$f":"IF(O16=\"*\",IF(AND(OFFSET(INDIRECT(O15),0,0)>0,NOT(ISNA(OFFSET(INDIRECT(O15),0,1)))),OFFSET(INDIRECT(O15),0,1),UnsetMatchCompetitorText),IF(OFFSET(INDIRECT(O15),2,5)>0,IF(COUNTIF(INDIRECT(O16),(OFFSET(INDIRECT(O15),0,5)))>0,OFFSET(INDIRECT(O15),0,1),IF(COUNTIF(INDIRECT(O16),(OFFSET(INDIRECT(O15),1,5)))>0,OFFSET(INDIRECT(O15),1,1),BlankMatchCompetitorText)),AwaitingMatchCompetitorText))","v":"Nino PORIČ"},null,null,null,null,{"$f":"IF(U16=NormalWinState,AND(U17=NormalLoseState,T16>T17),TRUE)","v":true},"*",{"$f":"Z14","v":11},{"$f":"IF(W16=\"*\",IF(AND(OFFSET(INDIRECT(W15),0,0)>0,NOT(ISNA(OFFSET(INDIRECT(W15),0,1)))),OFFSET(INDIRECT(W15),0,1),UnsetMatchCompetitorText),IF(OFFSET(INDIRECT(W15),2,5)>0,IF(COUNTIF(INDIRECT(W16),(OFFSET(INDIRECT(W15),0,5)))>0,OFFSET(INDIRECT(W15),0,1),IF(COUNTIF(INDIRECT(W16),(OFFSET(INDIRECT(W15),1,5)))>0,OFFSET(INDIRECT(W15),1,1),BlankMatchCompetitorText)),AwaitingMatchCompetitorText))","v":"Lovro KOKOT"},null,null,1,"L",{"$f":"IF(AC16=NormalWinState,AND(AC17=NormalLoseState,AB16>AB17),TRUE)","v":true},"*",{"$f":"AH14","v":12},{"$f":"IF(AE16=\"*\",IF(AND(OFFSET(INDIRECT(AE15),0,0)>0,NOT(ISNA(OFFSET(INDIRECT(AE15),0,1)))),OFFSET(INDIRECT(AE15),0,1),UnsetMatchCompetitorText),IF(OFFSET(INDIRECT(AE15),2,5)>0,IF(COUNTIF(INDIRECT(AE16),(OFFSET(INDIRECT(AE15),0,5)))>0,OFFSET(INDIRECT(AE15),0,1),IF(COUNTIF(INDIRECT(AE16),(OFFSET(INDIRECT(AE15),1,5)))>0,OFFSET(INDIRECT(AE15),1,1),BlankMatchCompetitorText)),AwaitingMatchCompetitorText))","v":""},null,null,null,null,{"$f":"IF(AK16=NormalWinState,AND(AK17=NormalLoseState,AJ16>AJ17),TRUE)","v":true},null,null,null,null,null,null,null,null,null,null,null,null,null,null,null,null,null,null,null,null,null,null,null,null,null,null,null,null,null,null,null,null,null,null,null,null,null,null,null,null,15,{"$f":"CB15","v":22},{"$f":"CC15+8","v":24},"$X$22",{"$f":"CONCATENATE($B$2)","v":"4"},15,"","09:00:00",0,"","00:00:00","00:00:00","","",0,0,0,"Lovro KOKOT",915,0,0,0,false]
["Q",{"$f":"VLOOKUP(D17,BN$4:BP$11,2,)","v":"Franci ČUČNIK"},{"$f":"VLOOKUP(D17,BN$4:BP$11,3,)","v":""},2,null,null,{"$f":"CELL(\"address\",OFFSET($A$5,L14,0))","v":"$A$6"},null,{"$f":"IF(G18=\"*\",IF(AND(OFFSET(INDIRECT(G17),0,0)>0,NOT(ISNA(OFFSET(INDIRECT(G17),0,1)))),OFFSET(INDIRECT(G17),0,1),UnsetMatchCompetitorText),IF(OFFSET(INDIRECT(G17),2,5)>0,IF(COUNTIF(INDIRECT(G18),(OFFSET(INDIRECT(G17),0,5)))>0,OFFSET(INDIRECT(G17),0,1),IF(COUNTIF(INDIRECT(G18),(OFFSET(INDIRECT(G17),1,5)))>0,OFFSET(INDIRECT(G17),1,1),BlankMatchCompetitorText)),AwaitingMatchCompetitorText))","v":"Franci ČUČNIK"},null,null,null,null,{"$f":"IF(M17=NormalWinState,AND(M16=NormalLoseState,L17>L16),TRUE)","v":true},{"$f":"CELL(\"address\",OFFSET($A$5,T14,0))","v":"$A$12"},null,{"$f":"IF(O18=\"*\",IF(AND(OFFSET(INDIRECT(O17),0,0)>0,NOT(ISNA(OFFSET(INDIRECT(O17),0,1)))),OFFSET(INDIRECT(O17),0,1),UnsetMatchCompetitorText),IF(OFFSET(INDIRECT(O17),2,5)>0,IF(COUNTIF(INDIRECT(O18),(OFFSET(INDIRECT(O17),0,5)))>0,OFFSET(INDIRECT(O17),0,1),IF(COUNTIF(INDIRECT(O18),(OFFSET(INDIRECT(O17),1,5)))>0,OFFSET(INDIRECT(O17),1,1),BlankMatchCompetitorText)),AwaitingMatchCompetitorText))","v":""},null,null,null,null,{"$f":"IF(U17=NormalWinState,AND(U16=NormalLoseState,T17>T16),TRUE)","v":true},{"$f":"CELL(\"address\",OFFSET($A$5,AB14,0))","v":"$A$11"},null,{"$f":"IF(W18=\"*\",IF(AND(OFFSET(INDIRECT(W17),0,0)>0,NOT(ISNA(OFFSET(INDIRECT(W17),0,1)))),OFFSET(INDIRECT(W17),0,1),UnsetMatchCompetitorText),IF(OFFSET(INDIRECT(W17),2,5)>0,IF(COUNTIF(INDIRECT(W18),(OFFSET(INDIRECT(W17),0,5)))>0,OFFSET(INDIRECT(W17),0,1),IF(COUNTIF(INDIRECT(W18),(OFFSET(INDIRECT(W17),1,5)))>0,OFFSET(INDIRECT(W17),1,1),BlankMatchCompetitorText)),AwaitingMatchCompetitorText))","v":"Tomaž BENEDIČIČ"},null,null,5,"W",{"$f":"IF(AC17=NormalWinState,AND(AC16=NormalLoseState,AB17>AB16),TRUE)","v":true},{"$f":"CELL(\"address\",OFFSET($A$5,AJ14,0))","v":"$A$13"},null,{"$f":"IF(AE18=\"*\",IF(AND(OFFSET(INDIRECT(AE17),0,0)>0,NOT(ISNA(OFFSET(INDIRECT(AE17),0,1)))),OFFSET(INDIRECT(AE17),0,1),UnsetMatchCompetitorText),IF(OFFSET(INDIRECT(AE17),2,5)>0,IF(COUNTIF(INDIRECT(AE18),(OFFSET(INDIRECT(AE17),0,5)))>0,OFFSET(INDIRECT(AE17),0,1),IF(COUNTIF(INDIRECT(AE18),(OFFSET(INDIRECT(AE17),1,5)))>0,OFFSET(INDIRECT(AE17),1,1),BlankMatchCompetitorText)),AwaitingMatchCompetitorText))","v":"Sašo MEŽEK"},null,null,null,null,{"$f":"IF(AK17=NormalWinState,AND(AK16=NormalLoseState,AJ17>AJ16),TRUE)","v":true},null,null,null,null,null,null,null,null,null,null,null,null,null,null,null,null,null,null,null,null,null,null,null,null,null,null,null,null,null,null,null,null,null,null,null,null,null,null,null,null,16,{"$f":"CB16","v":22},{"$f":"CC16+8","v":32},"$AF$22",{"$f":"CONCATENATE($B$2)","v":"4"},16,"","09:00:00",5,"","10:22:00","10:23:00","00:01:00","Sašo MEŽEK",689,0,"DNS","Tomaž BENEDIČIČ",1,0,"WO","F",true]
[{"$f":"A19-TournamentGroupCount","v":17},{"$error":"#N/A"},{"$error":"#N/A"},3,null,null,"*",null,null,null,{"$f":"IF(ISBLANK(I18),\"\",IF(ISBLANK(J18),CurrentTime-I18,J18-I18))","v":""},null,{"$f":"IF(AND(COUNTIF(FinishedMatchStates,L18),NOT(ISNA(VLOOKUP(M16,MatchCompetitorStateCodes,1,FALSE))),NOT(ISNA(VLOOKUP(M17,MatchCompetitorStateCodes,1,FALSE))),COUNTIF(WinStates,M16)+COUNTIF(WinStates,M17)<=1,COUNTIF(LoseStates,M16)+COUNTIF(LoseStates,M17)<=1,IF(M16=NormalWinState,AND(M17=NormalLoseState,L16>L17),TRUE),IF(M17=NormalWinState,AND(M16=NormalLoseState,L17>L16),TRUE),NOT(ISBLANK(L15)),NOT(ISBLANK(I15)),NOT(ISBLANK(I18)),NOT(ISBLANK(J18)),H15>0),1,IF(COUNTIF(FinishedMatchStates,L18)>0,-1,0))","v":0},null,"*",null,null,null,{"$f":"IF(ISBLANK(Q18),\"\",IF(ISBLANK(R18),CurrentTime-Q18,R18-Q18))","v":""},null,{"$f":"IF(AND(COUNTIF(FinishedMatchStates,T18),NOT(ISNA(VLOOKUP(U16,MatchCompetitorStateCodes,1,FALSE))),NOT(ISNA(VLOOKUP(U17,MatchCompetitorStateCodes,1,FALSE))),COUNTIF(WinStates,U16)+COUNTIF(WinStates,U17)<=1,COUNTIF(LoseStates,U16)+COUNTIF(LoseStates,U17)<=1,IF(U16=NormalWinState,AND(U17=NormalLoseState,T16>T17),TRUE),IF(U17=NormalWinState,AND(U16=NormalLoseState,T17>T16),TRUE),NOT(ISBLANK(T15)),NOT(ISBLANK(Q15)),NOT(ISBLANK(Q18)),NOT(ISBLANK(R18)),P15>0),1,IF(COUNTIF(FinishedMatchStates,T18)>0,-1,0))","v":0},null,"*",8,"09:15:00","09:53:00",{"$f":"IF(ISBLANK(Y18),\"\",IF(ISBLANK(Z18),CurrentTime-Y18,Z18-Y18))","v":"00:38:00"},"F",{"$f":"IF(AND(COUNTIF(FinishedMatchStates,AB18),NOT(ISNA(VLOOKUP(AC16,MatchCompetitorStateCodes,1,FALSE))),NOT(ISNA(VLOOKUP(AC17,MatchCompetitorStateCodes,1,FALSE))),COUNTIF(WinStates,AC16)+COUNTIF(WinStates,AC17)<=1,COUNTIF(LoseStates,AC16)+COUNTIF(LoseStates,AC17)<=1,IF(AC16=NormalWinState,AND(AC17=NormalLoseState,AB16>AB17),TRUE),IF(AC17=NormalWinState,AND(AC16=NormalLoseState,AB17>AB16),TRUE),NOT(ISBLANK(AB15)),NOT(ISBLANK(Y15)),NOT(ISBLANK(Y18)),NOT(ISBLANK(Z18)),X15>0),1,IF(COUNTIF(FinishedMatchStates,AB18)>0,-1,0))","v":1},null,"*",null,null,null,{"$f":"IF(ISBLANK(AG18),\"\",IF(ISBLANK(AH18),CurrentTime-AG18,AH18-AG18))","v":""},null,{"$f":"IF(AND(COUNTIF(FinishedMatchStates,AJ18),NOT(ISNA(VLOOKUP(AK16,MatchCompetitorStateCodes,1,FALSE))),NOT(ISNA(VLOOKUP(AK17,MatchCompetitorStateCodes,1,FALSE))),COUNTIF(WinStates,AK16)+COUNTIF(WinStates,AK17)<=1,COUNTIF(LoseStates,AK16)+COUNTIF(LoseStates,AK17)<=1,IF(AK16=NormalWinState,AND(AK17=NormalLoseState,AJ16>AJ17),TRUE),IF(AK17=NormalWinState,AND(AK16=NormalLoseState,AJ17>AJ16),TRUE),NOT(ISBLANK(AJ15)),NOT(ISBLANK(AG15)),NOT(ISBLANK(AG18)),NOT(ISBLANK(AH18)),AF15>0),1,IF(COUNTIF(FinishedMatchStates,AJ18)>0,-1,0))","v":0},null,null,null,null,null,null,null,null,null,null,null,null,null,null,null,null,null,null,null,null,null,null,null,null,null,null,null,null,null,null,null,null,null,null,null,null,null,null,null,null,null,17,{"$f":"CB14+6","v":28},{"$f":"CC14","v":8},"$H$28","4",17,"8","09:00:00",5,"","10:49:00","11:30:00","00:41:00","Lovro KOKOT",915,0,"L","Franci ČUČNIK",891,5,"W","F",true]
[{"$f":"A20-TournamentGroupCount","v":21},{"$error":"#N/A"},{"$error":"#N/A"},4,null,null,null,null,null,null,null,null,null,null,null,null,null,null,null,null,null,null,null,null,null,null,null,null,null,null,null,null,null,null,null,null,null,null,null,null,null,null,null,null,null,null,null,null,null,null,null,null,null,null,null,null,null,null,null,null,null,null,null,null,null,null,null,null,null,null,null,null,null,null,null,null,null,null,18,{"$f":"CB18","v":28},{"$f":"CC18+8","v":16},"$P$28",{"$f":"CONCATENATE($B$2)","v":"4"},18,"","09:00:00",0,"","00:00:00","00:00:00","","Nino PORIČ",866,0,0,"",0,0,0,0,false]
[{"$f":"A21-TournamentGroupCount","v":25},{"$error":"#N/A"},{"$error":"#N/A"},5,null,null,{"$f":"G14","v":1},{"$f":"H14+1","v":4},{"$f":"I14","v":1},{"$f":"((H20-1)*$B$3)+I20","v":13},1,4,null,null,{"$f":"G20","v":1},{"$f":"H20","v":4},{"$f":"I20+1","v":2},{"$f":"((P20-1)*$B$3)+Q20","v":14},2,3,null,null,{"$f":"O20","v":1},{"$f":"P20","v":4},{"$f":"Q20+1","v":3},{"$f":"((X20-1)*$B$3)+Y20","v":15},7,5,null,null,{"$f":"W20","v":1},{"$f":"X20","v":4},{"$f":"Y20+1","v":4},{"$f":"((AF20-1)*$B$3)+AG20","v":16},8,6,null,null,null,null,null,null,null,null,null,null,null,null,null,null,null,null,null,null,null,null,null,null,null,null,null,null,null,null,null,null,null,null,null,null,null,null,null,null,null,null,null,null,19,{"$f":"CB19","v":28},{"$f":"CC19+8","v":24},"$X$28",{"$f":"CONCATENATE($B$2)","v":"4"},19,"","09:00:00",0,"","00:00:00","00:00:00","","Tomaž BENEDIČIČ",1,0,0,"",0,0,0,0,false]
[{"$f":"A22-TournamentGroupCount","v":29},{"$error":"#N/A"},{"$error":"#N/A"},6,null,null,{"$f":"CELL(\"address\",OFFSET($A$5,K20,0))","v":"$A$6"},{"$f":"IF(AND(NOT(ISBLANK(I22)),I22<>UnsetMatchCompetitorText,I22<>AwaitingMatchCompetitorText,NOT(ISBLANK(I23)),I23<>UnsetMatchCompetitorText,I23<>AwaitingMatchCompetitorText),1,IF(AND(I22<>AwaitingMatchCompetitorText,I23<>AwaitingMatchCompetitorText),-1,0))","v":1},"09:00:00",null,null,5,null,null,{"$f":"CELL(\"address\",OFFSET($A$5,S20,0))","v":"$A$7"},{"$f":"IF(AND(NOT(ISBLANK(Q22)),Q22<>UnsetMatchCompetitorText,Q22<>AwaitingMatchCompetitorText,NOT(ISBLANK(Q23)),Q23<>UnsetMatchCompetitorText,Q23<>AwaitingMatchCompetitorText),1,IF(AND(Q22<>AwaitingMatchCompetitorText,Q23<>AwaitingMatchCompetitorText),-1,0))","v":1},"09:00:00",null,null,null,null,null,{"$f":"CELL(\"address\",OFFSET($A$5,AA20,0))","v":"$A$12"},{"$f":"IF(AND(NOT(ISBLANK(Y22)),Y22<>UnsetMatchCompetitorText,Y22<>AwaitingMatchCompetitorText,NOT(ISBLANK(Y23)),Y23<>UnsetMatchCompetitorText,Y23<>AwaitingMatchCompetitorText),1,IF(AND(Y22<>AwaitingMatchCompetitorText,Y23<>AwaitingMatchCompetitorText),-1,0))","v":1},"09:00:00",null,null,null,null,null,{"$f":"CELL(\"address\",OFFSET($A$5,AI20,0))","v":"$A$13"},{"$f":"IF(AND(NOT(ISBLANK(AG22)),AG22<>UnsetMatchCompetitorText,AG22<>AwaitingMatchCompetitorText,NOT(ISBLANK(AG23)),AG23<>UnsetMatchCompetitorText,AG23<>AwaitingMatchCompetitorText),1,IF(AND(AG22<>AwaitingMatchCompetitorText,AG23<>AwaitingMatchCompetitorText),-1,0))","v":1},"09:00:00",null,null,5,null,null,null,null,null,null,null,null,null,null,null,null,null,null,null,null,null,null,null,null,null,null,null,null,null,null,null,null,null,null,null,null,null,null,null,null,null,null,null,null,null,null,20,{"$f":"CB20","v":28},{"$f":"CC20+8","v":32},"$AF$28",{"$f":"CONCATENATE($B$2)","v":"4"},20,"","09:00:00",0,"","00:00:00","00:00:00","","",0,0,0,"Sašo MEŽEK",689,0,0,0,false]
[{"$f":"A23-TournamentGroupCount","v":33},{"$error":"#N/A"},{"$error":"#N/A"},7,null,null,"*",{"$f":"J20","v":13},{"$f":"IF(G22=\"*\",IF(AND(OFFSET(INDIRECT(G21),0,0)>0,NOT(ISNA(OFFSET(INDIRECT(G21),0,1)))),OFFSET(INDIRECT(G21),0,1),UnsetMatchCompetitorText),IF(OFFSET(INDIRECT(G21),2,5)>0,IF(COUNTIF(INDIRECT(G22),(OFFSET(INDIRECT(G21),0,5)))>0,OFFSET(INDIRECT(G21),0,1),IF(COUNTIF(INDIRECT(G22),(OFFSET(INDIRECT(G21),1,5)))>0,OFFSET(INDIRECT(G21),1,1),BlankMatchCompetitorText)),AwaitingMatchCompetitorText))","v":"Franci ČUČNIK"},null,null,3,"L",{"$f":"IF(M22=NormalWinState,AND(M23=NormalLoseState,L22>L23),TRUE)","v":true},"*",{"$f":"R20","v":14},{"$f":"IF(O22=\"*\",IF(AND(OFFSET(INDIRECT(O21),0,0)>0,NOT(ISNA(OFFSET(INDIRECT(O21),0,1)))),OFFSET(INDIRECT(O21),0,1),UnsetMatchCompetitorText),IF(OFFSET(INDIRECT(O21),2,5)>0,IF(COUNTIF(INDIRECT(O22),(OFFSET(INDIRECT(O21),0,5)))>0,OFFSET(INDIRECT(O21),0,1),IF(COUNTIF(INDIRECT(O22),(OFFSET(INDIRECT(O21),1,5)))>0,OFFSET(INDIRECT(O21),1,1),BlankMatchCompetitorText)),AwaitingMatchCompetitorText))","v":""},null,null,null,null,{"$f":"IF(U22=NormalWinState,AND(U23=NormalLoseState,T22>T23),TRUE)","v":true},"*",{"$f":"Z20","v":15},{"$f":"IF(W22=\"*\",IF(AND(OFFSET(INDIRECT(W21),0,0)>0,NOT(ISNA(OFFSET(INDIRECT(W21),0,1)))),OFFSET(INDIRECT(W21),0,1),UnsetMatchCompetitorText),IF(OFFSET(INDIRECT(W21),2,5)>0,IF(COUNTIF(INDIRECT(W22),(OFFSET(INDIRECT(W21),0,5)))>0,OFFSET(INDIRECT(W21),0,1),IF(COUNTIF(INDIRECT(W22),(OFFSET(INDIRECT(W21),1,5)))>0,OFFSET(INDIRECT(W21),1,1),BlankMatchCompetitorText)),AwaitingMatchCompetitorText))","v":""},null,null,null,null,{"$f":"IF(AC22=NormalWinState,AND(AC23=NormalLoseState,AB22>AB23),TRUE)","v":true},"*",{"$f":"AH20","v":16},{"$f":"IF(AE22=\"*\",IF(AND(OFFSET(INDIRECT(AE21),0,0)>0,NOT(ISNA(OFFSET(INDIRECT(AE21),0,1)))),OFFSET(INDIRECT(AE21),0,1),UnsetMatchCompetitorText),IF(OFFSET(INDIRECT(AE21),2,5)>0,IF(COUNTIF(INDIRECT(AE22),(OFFSET(INDIRECT(AE21),0,5)))>0,OFFSET(INDIRECT(AE21),0,1),IF(COUNTIF(INDIRECT(AE22),(OFFSET(INDIRECT(AE21),1,5)))>0,OFFSET(INDIRECT(AE21),1,1),BlankMatchCompetitorText)),AwaitingMatchCompetitorText))","v":"Sašo MEŽEK"},null,null,null,"DNS",{"$f":"IF(AK22=NormalWinState,AND(AK23=NormalLoseState,AJ22>AJ23),TRUE)","v":true},null,null,null,null,null,null,null,null,null,null,null,null,null,null,null,null,null,null,null,null,null,null,null,null,null,null,null,null,null,null,null,null,null,null,null,null,null,null,null,null,21,{"$f":"CB18+6","v":34},{"$f":"CC18","v":8},"$H$34","4",21,"8","09:00:00",5,"","11:32:00","12:29:00","00:57:00","Franci ČUČNIK",891,5,"W","Tomaž BENEDIČIČ",1,0,"L","F",true]
[{"$f":"TournamentSize-TournamentGroupCount+1","v":37},{"$error":"#N/A"},{"$error":"#N/A"},8,null,null,{"$f":"CELL(\"address\",OFFSET($A$5,L20,0))","v":"$A$9"},null,{"$f":"IF(G24=\"*\",IF(AND(OFFSET(INDIRECT(G23),0,0)>0,NOT(ISNA(OFFSET(INDIRECT(G23),0,1)))),OFFSET(INDIRECT(G23),0,1),UnsetMatchCompetitorText),IF(OFFSET(INDIRECT(G23),2,5)>0,IF(COUNTIF(INDIRECT(G24),(OFFSET(INDIRECT(G23),0,5)))>0,OFFSET(INDIRECT(G23),0,1),IF(COUNTIF(INDIRECT(G24),(OFFSET(INDIRECT(G23),1,5)))>0,OFFSET(INDIRECT(G23),1,1),BlankMatchCompetitorText)),AwaitingMatchCompetitorText))","v":"Nino PORIČ"},null,null,5,"W",{"$f":"IF(M23=NormalWinState,AND(M22=NormalLoseState,L23>L22),TRUE)","v":true},{"$f":"CELL(\"address\",OFFSET($A$5,T20,0))","v":"$A$8"},null,{"$f":"IF(O24=\"*\",IF(AND(OFFSET(INDIRECT(O23),0,0)>0,NOT(ISNA(OFFSET(INDIRECT(O23),0,1)))),OFFSET(INDIRECT(O23),0,1),UnsetMatchCompetitorText),IF(OFFSET(INDIRECT(O23),2,5)>0,IF(COUNTIF(INDIRECT(O24),(OFFSET(INDIRECT(O23),0,5)))>0,OFFSET(INDIRECT(O23),0,1),IF(COUNTIF(INDIRECT(O24),(OFFSET(INDIRECT(O23),1,5)))>0,OFFSET(INDIRECT(O23),1,1),BlankMatchCompetitorText)),AwaitingMatchCompetitorText))","v":""},null,null,null,null,{"$f":"IF(U23=NormalWinState,AND(U22=NormalLoseState,T23>T22),TRUE)","v":true},{"$f":"CELL(\"address\",OFFSET($A$5,AB20,0))","v":"$A$10"},null,{"$f":"IF(W24=\"*\",IF(AND(OFFSET(INDIRECT(W23),0,0)>0,NOT(ISNA(OFFSET(INDIRECT(W23),0,1)))),OFFSET(INDIRECT(W23),0,1),UnsetMatchCompetitorText),IF(OFFSET(INDIRECT(W23),2,5)>0,IF(COUNTIF(INDIRECT(W24),(OFFSET(INDIRECT(W23),0,5)))>0,OFFSET(INDIRECT(W23),0,1),IF(COUNTIF(INDIRECT(W24),(OFFSET(INDIRECT(W23),1,5)))>0,OFFSET(INDIRECT(W23),1,1),BlankMatchCompetitorText)),AwaitingMatchCompetitorText))","v":"Lovro KOKOT"},null,null,null,null,{"$f":"IF(AC23=NormalWinState,AND(AC22=NormalLoseState,AB23>AB22),TRUE)","v":true},{"$f":"CELL(\"address\",OFFSET($A$5,AJ20,0))","v":"$A$11"},null,{"$f":"IF(AE24=\"*\",IF(AND(OFFSET(INDIRECT(AE23),0,0)>0,NOT(ISNA(OFFSET(INDIRECT(AE23),0,1)))),OFFSET(INDIRECT(AE23),0,1),UnsetMatchCompetitorText),IF(OFFSET(INDIRECT(AE23),2,5)>0,IF(COUNTIF(INDIRECT(AE24),(OFFSET(INDIRECT(AE23),0,5)))>0,OFFSET(INDIRECT(AE23),0,1),IF(COUNTIF(INDIRECT(AE24),(OFFSET(INDIRECT(AE23),1,5)))>0,OFFSET(INDIRECT(AE23),1,1),BlankMatchCompetitorText)),AwaitingMatchCompetitorText))","v":"Tomaž BENEDIČIČ"},null,null,null,"WO",{"$f":"IF(AK23=NormalWinState,AND(AK22=NormalLoseState,AJ23>AJ22),TRUE)","v":true},null,null,null,null,null,null,null,null,null,null,null,null,null,null,null,null,null,null,null,null,null,null,null,null,null,null,null,null,null,null,null,null,null,null,null,null,null,null,null,null,22,{"$f":"CB22","v":34},{"$f":"CC22+8","v":16},"$P$34",{"$f":"CONCATENATE($B$2)","v":"4"},22,"","09:00:00",0,"","00:00:00","00:00:00","","",0,0,0,"Lovro KOKOT",915,0,0,0,false]
[null,null,null,null,null,null,"*",7,"09:17:00","10:44:00",{"$f":"IF(ISBLANK(I24),\"\",IF(ISBLANK(J24),CurrentTime-I24,J24-I24))","v":"01:27:00"},"F",{"$f":"IF(AND(COUNTIF(FinishedMatchStates,L24),NOT(ISNA(VLOOKUP(M22,MatchCompetitorStateCodes,1,FALSE))),NOT(ISNA(VLOOKUP(M23,MatchCompetitorStateCodes,1,FALSE))),COUNTIF(WinStates,M22)+COUNTIF(WinStates,M23)<=1,COUNTIF(LoseStates,M22)+COUNTIF(LoseStates,M23)<=1,IF(M22=NormalWinState,AND(M23=NormalLoseState,L22>L23),TRUE),IF(M23=NormalWinState,AND(M22=NormalLoseState,L23>L22),TRUE),NOT(ISBLANK(L21)),NOT(ISBLANK(I21)),NOT(ISBLANK(I24)),NOT(ISBLANK(J24)),H21>0),1,IF(COUNTIF(FinishedMatchStates,L24)>0,-1,0))","v":1},null,"*",null,null,null,{"$f":"IF(ISBLANK(Q24),\"\",IF(ISBLANK(R24),CurrentTime-Q24,R24-Q24))","v":""},null,{"$f":"IF(AND(COUNTIF(FinishedMatchStates,T24),NOT(ISNA(VLOOKUP(U22,MatchCompetitorStateCodes,1,FALSE))),NOT(ISNA(VLOOKUP(U23,MatchCompetitorStateCodes,1,FALSE))),COUNTIF(WinStates,U22)+COUNTIF(WinStates,U23)<=1,COUNTIF(LoseStates,U22)+COUNTIF(LoseStates,U23)<=1,IF(U22=NormalWinState,AND(U23=NormalLoseState,T22>T23),TRUE),IF(U23=NormalWinState,AND(U22=NormalLoseState,T23>T22),TRUE),NOT(ISBLANK(T21)),NOT(ISBLANK(Q21)),NOT(ISBLANK(Q24)),NOT(ISBLANK(R24)),P21>0),1,IF(COUNTIF(FinishedMatchStates,T24)>0,-1,0))","v":0},null,"*",null,null,null,{"$f":"IF(ISBLANK(Y24),\"\",IF(ISBLANK(Z24),CurrentTime-Y24,Z24-Y24))","v":""},null,{"$f":"IF(AND(COUNTIF(FinishedMatchStates,AB24),NOT(ISNA(VLOOKUP(AC22,MatchCompetitorStateCodes,1,FALSE))),NOT(ISNA(VLOOKUP(AC23,MatchCompetitorStateCodes,1,FALSE))),COUNTIF(WinStates,AC22)+COUNTIF(WinStates,AC23)<=1,COUNTIF(LoseStates,AC22)+COUNTIF(LoseStates,AC23)<=1,IF(AC22=NormalWinState,AND(AC23=NormalLoseState,AB22>AB23),TRUE),IF(AC23=NormalWinState,AND(AC22=NormalLoseState,AB23>AB22),TRUE),NOT(ISBLANK(AB21)),NOT(ISBLANK(Y21)),NOT(ISBLANK(Y24)),NOT(ISBLANK(Z24)),X21>0),1,IF(COUNTIF(FinishedMatchStates,AB24)>0,-1,0))","v":0},null,"*",null,"10:22:00","10:23:00",{"$f":"IF(ISBLANK(AG24),\"\",IF(ISBLANK(AH24),CurrentTime-AG24,AH24-AG24))","v":"00:01:00"},"F",{"$f":"IF(AND(COUNTIF(FinishedMatchStates,AJ24),NOT(ISNA(VLOOKUP(AK22,MatchCompetitorStateCodes,1,FALSE))),NOT(ISNA(VLOOKUP(AK23,MatchCompetitorStateCodes,1,FALSE))),COUNTIF(WinStates,AK22)+COUNTIF(WinStates,AK23)<=1,COUNTIF(LoseStates,AK22)+COUNTIF(LoseStates,AK23)<=1,IF(AK22=NormalWinState,AND(AK23=NormalLoseState,AJ22>AJ23),TRUE),IF(AK23=NormalWinState,AND(AK22=NormalLoseState,AJ23>AJ22),TRUE),NOT(ISBLANK(AJ21)),NOT(ISBLANK(AG21)),NOT(ISBLANK(AG24)),NOT(ISBLANK(AH24)),AF21>0),1,IF(COUNTIF(FinishedMatchStates,AJ24)>0,-1,0))","v":1},null,null,null,null,null,null,null,null,null,null,null,null,null,null,null,null,null,null,null,null,null,null,null,null,null,null,null,null,null,null,null,null,null,null,null,null,null,null,null,null,null,23,{"$f":"CB23","v":34},{"$f":"CC23+8","v":24},"$X$34",{"$f":"CONCATENATE($B$2)","v":"4"},23,"","09:00:00",0,"","00:00:00","00:00:00","","",0,0,0,"Nino PORIČ",866,0,0,0,false]
[null,null,null,null,null,null,null,null,null,null,null,null,null,null,null,null,null,null,null,null,null,null,null,null,null,null,null,null,null,null,null,null,null,null,null,null,null,null,null,null,null,null,null,null,null,null,null,null,null,null,null,null,null,null,null,null,null,null,null,null,null,null,null,null,null,null,null,null,null,null,null,null,null,null,null,null,null,null,24,{"$f":"CB24","v":34},{"$f":"CC24+8","v":32},"$AF$34",{"$f":"CONCATENATE($B$2)","v":"4"},24,"","09:00:00",0,"","00:00:00","00:00:00","","Sašo MEŽEK",689,0,0,"",0,0,0,0,false]
[null,null,null,null,null,null,{"$f":"G20","v":1},{"$f":"H20+1","v":5},{"$f":"I20","v":1},{"$f":"((H26-1)*$B$3)+I26","v":17},5,1,null,null,{"$f":"G26","v":1},{"$f":"H26","v":5},{"$f":"I26+1","v":2},{"$f":"((P26-1)*$B$3)+Q26","v":18},4,2,null,null,{"$f":"O26","v":1},{"$f":"P26","v":5},{"$f":"Q26+1","v":3},{"$f":"((X26-1)*$B$3)+Y26","v":19},6,7,null,null,{"$f":"W26","v":1},{"$f":"X26","v":5},{"$f":"Y26+1","v":4},{"$f":"((AF26-1)*$B$3)+AG26","v":20},3,8,null,null,null,null,null,null,null,null,null,null,null,null,null,null,null,null,null,null,null,null,null,null,null,null,null,null,null,null,null,null,null,null,null,null,null,null,null,null,null,null,null,null,25,{"$f":"CB22+6","v":40},{"$f":"CC22","v":8},"$H$40","4",25,"","09:00:00",0,"","00:00:00","00:00:00","","",0,0,0,"Franci ČUČNIK",891,0,0,0,false]
[null,null,null,null,null,null,{"$f":"CELL(\"address\",OFFSET($A$5,K26,0))","v":"$A$10"},{"$f":"IF(AND(NOT(ISBLANK(I28)),I28<>UnsetMatchCompetitorText,I28<>AwaitingMatchCompetitorText,NOT(ISBLANK(I29)),I29<>UnsetMatchCompetitorText,I29<>AwaitingMatchCompetitorText),1,IF(AND(I28<>AwaitingMatchCompetitorText,I29<>AwaitingMatchCompetitorText),-1,0))","v":1},"09:00:00",null,null,5,null,null,{"$f":"CELL(\"address\",OFFSET($A$5,S26,0))","v":"$A$9"},{"$f":"IF(AND(NOT(ISBLANK(Q28)),Q28<>UnsetMatchCompetitorText,Q28<>AwaitingMatchCompetitorText,NOT(ISBLANK(Q29)),Q29<>UnsetMatchCompetitorText,Q29<>AwaitingMatchCompetitorText),1,IF(AND(Q28<>AwaitingMatchCompetitorText,Q29<>AwaitingMatchCompetitorText),-1,0))","v":1},"09:00:00",null,null,null,null,null,{"$f":"CELL(\"address\",OFFSET($A$5,AA26,0))","v":"$A$11"},{"$f":"IF(AND(NOT(ISBLANK(Y28)),Y28<>UnsetMatchCompetitorText,Y28<>AwaitingMatchCompetitorText,NOT(ISBLANK(Y29)),Y29<>UnsetMatchCompetitorText,Y29<>AwaitingMatchCompetitorText),1,IF(AND(Y28<>AwaitingMatchCompetitorText,Y29<>AwaitingMatchCompetitorText),-1,0))","v":1},"09:00:00",null,null,null,null,null,{"$f":"CELL(\"address\",OFFSET($A$5,AI26,0))","v":"$A$8"},{"$f":"IF(AND(NOT(ISBLANK(AG28)),AG28<>UnsetMatchCompetitorText,AG28<>AwaitingMatchCompetitorText,NOT(ISBLANK(AG29)),AG29<>UnsetMatchCompetitorText,AG29<>AwaitingMatchCompetitorText),1,IF(AND(AG28<>AwaitingMatchCompetitorText,AG29<>AwaitingMatchCompetitorText),-1,0))","v":1},"09:00:00",null,null,null,null,null,null,null,null,null,null,null,null,null,null,null,null,null,null,null,null,null,null,null,null,null,null,null,null,null,null,null,null,null,null,null,null,null,null,null,null,null,null,null,null,null,26,{"$f":"CB26","v":40},{"$f":"CC26+8","v":16},"$P$40",{"$f":"CONCATENATE($B$2)","v":"4"},26,"","09:00:00",0,"","00:00:00","00:00:00","","Tomaž BENEDIČIČ",1,0,0,"",0,0,0,0,false]
[null,null,null,null,null,null,"*",{"$f":"J26","v":17},{"$f":"IF(G28=\"*\",IF(AND(OFFSET(INDIRECT(G27),0,0)>0,NOT(ISNA(OFFSET(INDIRECT(G27),0,1)))),OFFSET(INDIRECT(G27),0,1),UnsetMatchCompetitorText),IF(OFFSET(INDIRECT(G27),2,5)>0,IF(COUNTIF(INDIRECT(G28),(OFFSET(INDIRECT(G27),0,5)))>0,OFFSET(INDIRECT(G27),0,1),IF(COUNTIF(INDIRECT(G28),(OFFSET(INDIRECT(G27),1,5)))>0,OFFSET(INDIRECT(G27),1,1),BlankMatchCompetitorText)),AwaitingMatchCompetitorText))","v":"Lovro KOKOT"},null,null,0,"L",{"$f":"IF(M28=NormalWinState,AND(M29=NormalLoseState,L28>L29),TRUE)","v":true},"*",{"$f":"R26","v":18},{"$f":"IF(O28=\"*\",IF(AND(OFFSET(INDIRECT(O27),0,0)>0,NOT(ISNA(OFFSET(INDIRECT(O27),0,1)))),OFFSET(INDIRECT(O27),0,1),UnsetMatchCompetitorText),IF(OFFSET(INDIRECT(O27),2,5)>0,IF(COUNTIF(INDIRECT(O28),(OFFSET(INDIRECT(O27),0,5)))>0,OFFSET(INDIRECT(O27),0,1),IF(COUNTIF(INDIRECT(O28),(OFFSET(INDIRECT(O27),1,5)))>0,OFFSET(INDIRECT(O27),1,1),BlankMatchCompetitorText)),AwaitingMatchCompetitorText))","v":"Nino PORIČ"},null,null,null,null,{"$f":"IF(U28=NormalWinState,AND(U29=NormalLoseState,T28>T29),TRUE)","v":true},"*",{"$f":"Z26","v":19},{"$f":"IF(W28=\"*\",IF(AND(OFFSET(INDIRECT(W27),0,0)>0,NOT(ISNA(OFFSET(INDIRECT(W27),0,1)))),OFFSET(INDIRECT(W27),0,1),UnsetMatchCompetitorText),IF(OFFSET(INDIRECT(W27),2,5)>0,IF(COUNTIF(INDIRECT(W28),(OFFSET(INDIRECT(W27),0,5)))>0,OFFSET(INDIRECT(W27),0,1),IF(COUNTIF(INDIRECT(W28),(OFFSET(INDIRECT(W27),1,5)))>0,OFFSET(INDIRECT(W27),1,1),BlankMatchCompetitorText)),AwaitingMatchCompetitorText))","v":"Tomaž BENEDIČIČ"},null,null,null,null,{"$f":"IF(AC28=NormalWinState,AND(AC29=NormalLoseState,AB28>AB29),TRUE)","v":true},"*",{"$f":"AH26","v":20},{"$f":"IF(AE28=\"*\",IF(AND(OFFSET(INDIRECT(AE27),0,0)>0,NOT(ISNA(OFFSET(INDIRECT(AE27),0,1)))),OFFSET(INDIRECT(AE27),0,1),UnsetMatchCompetitorText),IF(OFFSET(INDIRECT(AE27),2,5)>0,IF(COUNTIF(INDIRECT(AE28),(OFFSET(INDIRECT(AE27),0,5)))>0,OFFSET(INDIRECT(AE27),0,1),IF(COUNTIF(INDIRECT(AE28),(OFFSET(INDIRECT(AE27),1,5)))>0,OFFSET(INDIRECT(AE27),1,1),BlankMatchCompetitorText)),AwaitingMatchCompetitorText))","v":""},null,null,null,null,{"$f":"IF(AK28=NormalWinState,AND(AK29=NormalLoseState,AJ28>AJ29),TRUE)","v":true},null,null,null,null,null,null,null,null,null,null,null,null,null,null,null,null,null,null,null,null,null,null,null,null,null,null,null,null,null,null,null,null,null,null,null,null,null,null,null,null,27,{"$f":"CB27","v":40},{"$f":"CC27+8","v":24},"$X$40",{"$f":"CONCATENATE($B$2)","v":"4"},27,"","09:00:00",0,"","00:00:00","00:00:00","","Lovro KOKOT",915,0,0,"",0,0,0,0,false]
[null,null,null,null,null,null,{"$f":"CELL(\"address\",OFFSET($A$5,L26,0))","v":"$A$6"},null,{"$f":"IF(G30=\"*\",IF(AND(OFFSET(INDIRECT(G29),0,0)>0,NOT(ISNA(OFFSET(INDIRECT(G29),0,1)))),OFFSET(INDIRECT(G29),0,1),UnsetMatchCompetitorText),IF(OFFSET(INDIRECT(G29),2,5)>0,IF(COUNTIF(INDIRECT(G30),(OFFSET(INDIRECT(G29),0,5)))>0,OFFSET(INDIRECT(G29),0,1),IF(COUNTIF(INDIRECT(G30),(OFFSET(INDIRECT(G29),1,5)))>0,OFFSET(INDIRECT(G29),1,1),BlankMatchCompetitorText)),AwaitingMatchCompetitorText))","v":"Franci ČUČNIK"},null,null,5,"W",{"$f":"IF(M29=NormalWinState,AND(M28=NormalLoseState,L29>L28),TRUE)","v":true},{"$f":"CELL(\"address\",OFFSET($A$5,T26,0))","v":"$A$7"},null,{"$f":"IF(O30=\"*\",IF(AND(OFFSET(INDIRECT(O29),0,0)>0,NOT(ISNA(OFFSET(INDIRECT(O29),0,1)))),OFFSET(INDIRECT(O29),0,1),UnsetMatchCompetitorText),IF(OFFSET(INDIRECT(O29),2,5)>0,IF(COUNTIF(INDIRECT(O30),(OFFSET(INDIRECT(O29),0,5)))>0,OFFSET(INDIRECT(O29),0,1),IF(COUNTIF(INDIRECT(O30),(OFFSET(INDIRECT(O29),1,5)))>0,OFFSET(INDIRECT(O29),1,1),BlankMatchCompetitorText)),AwaitingMatchCompetitorText))","v":""},null,null,null,null,{"$f":"IF(U29=NormalWinState,AND(U28=NormalLoseState,T29>T28),TRUE)","v":true},{"$f":"CELL(\"address\",OFFSET($A$5,AB26,0))","v":"$A$12"},null,{"$f":"IF(W30=\"*\",IF(AND(OFFSET(INDIRECT(W29),0,0)>0,NOT(ISNA(OFFSET(INDIRECT(W29),0,1)))),OFFSET(INDIRECT(W29),0,1),UnsetMatchCompetitorText),IF(OFFSET(INDIRECT(W29),2,5)>0,IF(COUNTIF(INDIRECT(W30),(OFFSET(INDIRECT(W29),0,5)))>0,OFFSET(INDIRECT(W29),0,1),IF(COUNTIF(INDIRECT(W30),(OFFSET(INDIRECT(W29),1,5)))>0,OFFSET(INDIRECT(W29),1,1),BlankMatchCompetitorText)),AwaitingMatchCompetitorText))","v":""},null,null,null,null,{"$f":"IF(AC29=NormalWinState,AND(AC28=NormalLoseState,AB29>AB28),TRUE)","v":true},{"$f":"CELL(\"address\",OFFSET($A$5,AJ26,0))","v":"$A$13"},null,{"$f":"IF(AE30=\"*\",IF(AND(OFFSET(INDIRECT(AE29),0,0)>0,NOT(ISNA(OFFSET(INDIRECT(AE29),0,1)))),OFFSET(INDIRECT(AE29),0,1),UnsetMatchCompetitorText),IF(OFFSET(INDIRECT(AE29),2,5)>0,IF(COUNTIF(INDIRECT(AE30),(OFFSET(INDIRECT(AE29),0,5)))>0,OFFSET(INDIRECT(AE29),0,1),IF(COUNTIF(INDIRECT(AE30),(OFFSET(INDIRECT(AE29),1,5)))>0,OFFSET(INDIRECT(AE29),1,1),BlankMatchCompetitorText)),AwaitingMatchCompetitorText))","v":"Sašo MEŽEK"},null,null,null,null,{"$f":"IF(AK29=NormalWinState,AND(AK28=NormalLoseState,AJ29>AJ28),TRUE)","v":true},null,null,null,null,null,null,null,null,null,null,null,null,null,null,null,null,null,null,null,null,null,null,null,null,null,null,null,null,null,null,null,null,null,null,null,null,null,null,null,null,28,{"$f":"CB28","v":40},{"$f":"CC28+8","v":32},"$AF$40",{"$f":"CONCATENATE($B$2)","v":"4"},28,"","09:00:00",5,"","10:22:00","10:23:00","00:01:00","Nino PORIČ",866,0,"WO","Sašo MEŽEK",689,0,"DNS","F",true]
[null,null,null,null,null,null,"*",8,"10:49:00","11:30:00",{"$f":"IF(ISBLANK(I30),\"\",IF(ISBLANK(J30),CurrentTime-I30,J30-I30))","v":"00:41:00"},"F",{"$f":"IF(AND(COUNTIF(FinishedMatchStates,L30),NOT(ISNA(VLOOKUP(M28,MatchCompetitorStateCodes,1,FALSE))),NOT(ISNA(VLOOKUP(M29,MatchCompetitorStateCodes,1,FALSE))),COUNTIF(WinStates,M28)+COUNTIF(WinStates,M29)<=1,COUNTIF(LoseStates,M28)+COUNTIF(LoseStates,M29)<=1,IF(M28=NormalWinState,AND(M29=NormalLoseState,L28>L29),TRUE),IF(M29=NormalWinState,AND(M28=NormalLoseState,L29>L28),TRUE),NOT(ISBLANK(L27)),NOT(ISBLANK(I27)),NOT(ISBLANK(I30)),NOT(ISBLANK(J30)),H27>0),1,IF(COUNTIF(FinishedMatchStates,L30)>0,-1,0))","v":1},null,"*",null,null,null,{"$f":"IF(ISBLANK(Q30),\"\",IF(ISBLANK(R30),CurrentTime-Q30,R30-Q30))","v":""},null,{"$f":"IF(AND(COUNTIF(FinishedMatchStates,T30),NOT(ISNA(VLOOKUP(U28,MatchCompetitorStateCodes,1,FALSE))),NOT(ISNA(VLOOKUP(U29,MatchCompetitorStateCodes,1,FALSE))),COUNTIF(WinStates,U28)+COUNTIF(WinStates,U29)<=1,COUNTIF(LoseStates,U28)+COUNTIF(LoseStates,U29)<=1,IF(U28=NormalWinState,AND(U29=NormalLoseState,T28>T29),TRUE),IF(U29=NormalWinState,AND(U28=NormalLoseState,T29>T28),TRUE),NOT(ISBLANK(T27)),NOT(ISBLANK(Q27)),NOT(ISBLANK(Q30)),NOT(ISBLANK(R30)),P27>0),1,IF(COUNTIF(FinishedMatchStates,T30)>0,-1,0))","v":0},null,"*",null,null,null,{"$f":"IF(ISBLANK(Y30),\"\",IF(ISBLANK(Z30),CurrentTime-Y30,Z30-Y30))","v":""},null,{"$f":"IF(AND(COUNTIF(FinishedMatchStates,AB30),NOT(ISNA(VLOOKUP(AC28,MatchCompetitorStateCodes,1,FALSE))),NOT(ISNA(VLOOKUP(AC29,MatchCompetitorStateCodes,1,FALSE))),COUNTIF(WinStates,AC28)+COUNTIF(WinStates,AC29)<=1,COUNTIF(LoseStates,AC28)+COUNTIF(LoseStates,AC29)<=1,IF(AC28=NormalWinState,AND(AC29=NormalLoseState,AB28>AB29),TRUE),IF(AC29=NormalWinState,AND(AC28=NormalLoseState,AB29>AB28),TRUE),NOT(ISBLANK(AB27)),NOT(ISBLANK(Y27)),NOT(ISBLANK(Y30)),NOT(ISBLANK(Z30)),X27>0),1,IF(COUNTIF(FinishedMatchStates,AB30)>0,-1,0))","v":0},null,"*",null,null,null,{"$f":"IF(ISBLANK(AG30),\"\",IF(ISBLANK(AH30),CurrentTime-AG30,AH30-AG30))","v":""},null,{"$f":"IF(AND(COUNTIF(FinishedMatchStates,AJ30),NOT(ISNA(VLOOKUP(AK28,MatchCompetitorStateCodes,1,FALSE))),NOT(ISNA(VLOOKUP(AK29,MatchCompetitorStateCodes,1,FALSE))),COUNTIF(WinStates,AK28)+COUNTIF(WinStates,AK29)<=1,COUNTIF(LoseStates,AK28)+COUNTIF(LoseStates,AK29)<=1,IF(AK28=NormalWinState,AND(AK29=NormalLoseState,AJ28>AJ29),TRUE),IF(AK29=NormalWinState,AND(AK28=NormalLoseState,AJ29>AJ28),TRUE),NOT(ISBLANK(AJ27)),NOT(ISBLANK(AG27)),NOT(ISBLANK(AG30)),NOT(ISBLANK(AH30)),AF27>0),1,IF(COUNTIF(FinishedMatchStates,AJ30)>0,-1,0))","v":0}]
[]
[null,null,null,null,null,null,{"$f":"G26","v":1},{"$f":"H26+1","v":6},{"$f":"I26","v":1},{"$f":"((H32-1)*$B$3)+I32","v":21},1,6,null,null,{"$f":"G32","v":1},{"$f":"H32","v":6},{"$f":"I32+1","v":2},{"$f":"((P32-1)*$B$3)+Q32","v":22},2,5,null,null,{"$f":"O32","v":1},{"$f":"P32","v":6},{"$f":"Q32+1","v":3},{"$f":"((X32-1)*$B$3)+Y32","v":23},3,4,null,null,{"$f":"W32","v":1},{"$f":"X32","v":6},{"$f":"Y32+1","v":4},{"$f":"((AF32-1)*$B$3)+AG32","v":24},8,7]
[null,null,null,null,null,null,{"$f":"CELL(\"address\",OFFSET($A$5,K32,0))","v":"$A$6"},{"$f":"IF(AND(NOT(ISBLANK(I34)),I34<>UnsetMatchCompetitorText,I34<>AwaitingMatchCompetitorText,NOT(ISBLANK(I35)),I35<>UnsetMatchCompetitorText,I35<>AwaitingMatchCompetitorText),1,IF(AND(I34<>AwaitingMatchCompetitorText,I35<>AwaitingMatchCompetitorText),-1,0))","v":1},"09:00:00",null,null,5,null,null,{"$f":"CELL(\"address\",OFFSET($A$5,S32,0))","v":"$A$7"},{"$f":"IF(AND(NOT(ISBLANK(Q34)),Q34<>UnsetMatchCompetitorText,Q34<>AwaitingMatchCompetitorText,NOT(ISBLANK(Q35)),Q35<>UnsetMatchCompetitorText,Q35<>AwaitingMatchCompetitorText),1,IF(AND(Q34<>AwaitingMatchCompetitorText,Q35<>AwaitingMatchCompetitorText),-1,0))","v":1},"09:00:00",null,null,null,null,null,{"$f":"CELL(\"address\",OFFSET($A$5,AA32,0))","v":"$A$8"},{"$f":"IF(AND(NOT(ISBLANK(Y34)),Y34<>UnsetMatchCompetitorText,Y34<>AwaitingMatchCompetitorText,NOT(ISBLANK(Y35)),Y35<>UnsetMatchCompetitorText,Y35<>AwaitingMatchCompetitorText),1,IF(AND(Y34<>AwaitingMatchCompetitorText,Y35<>AwaitingMatchCompetitorText),-1,0))","v":1},"09:00:00",null,null,null,null,null,{"$f":"CELL(\"address\",OFFSET($A$5,AI32,0))","v":"$A$13"},{"$f":"IF(AND(NOT(ISBLANK(AG34)),AG34<>UnsetMatchCompetitorText,AG34<>AwaitingMatchCompetitorText,NOT(ISBLANK(AG35)),AG35<>UnsetMatchCompetitorText,AG35<>AwaitingMatchCompetitorText),1,IF(AND(AG34<>AwaitingMatchCompetitorText,AG35<>AwaitingMatchCompetitorText),-1,0))","v":1},"09:00:00"]
[null,null,null,null,null,null,"*",{"$f":"J32","v":21},{"$f":"IF(G34=\"*\",IF(AND(OFFSET(INDIRECT(G33),0,0)>0,NOT(ISNA(OFFSET(INDIRECT(G33),0,1)))),OFFSET(INDIRECT(G33),0,1),UnsetMatchCompetitorText),IF(OFFSET(INDIRECT(G33),2,5)>0,IF(COUNTIF(INDIRECT(G34),(OFFSET(INDIRECT(G33),0,5)))>0,OFFSET(INDIRECT(G33),0,1),IF(COUNTIF(INDIRECT(G34),(OFFSET(INDIRECT(G33),1,5)))>0,OFFSET(INDIRECT(G33),1,1),BlankMatchCompetitorText)),AwaitingMatchCompetitorText))","v":"Franci ČUČNIK"},null,null,5,"W",{"$f":"IF(M34=NormalWinState,AND(M35=NormalLoseState,L34>L35),TRUE)","v":true},"*",{"$f":"R32","v":22},{"$f":"IF(O34=\"*\",IF(AND(OFFSET(INDIRECT(O33),0,0)>0,NOT(ISNA(OFFSET(INDIRECT(O33),0,1)))),OFFSET(INDIRECT(O33),0,1),UnsetMatchCompetitorText),IF(OFFSET(INDIRECT(O33),2,5)>0,IF(COUNTIF(INDIRECT(O34),(OFFSET(INDIRECT(O33),0,5)))>0,OFFSET(INDIRECT(O33),0,1),IF(COUNTIF(INDIRECT(O34),(OFFSET(INDIRECT(O33),1,5)))>0,OFFSET(INDIRECT(O33),1,1),BlankMatchCompetitorText)),AwaitingMatchCompetitorText))","v":""},null,null,null,null,{"$f":"IF(U34=NormalWinState,AND(U35=NormalLoseState,T34>T35),TRUE)","v":true},"*",{"$f":"Z32","v":23},{"$f":"IF(W34=\"*\",IF(AND(OFFSET(INDIRECT(W33),0,0)>0,NOT(ISNA(OFFSET(INDIRECT(W33),0,1)))),OFFSET(INDIRECT(W33),0,1),UnsetMatchCompetitorText),IF(OFFSET(INDIRECT(W33),2,5)>0,IF(COUNTIF(INDIRECT(W34),(OFFSET(INDIRECT(W33),0,5)))>0,OFFSET(INDIRECT(W33),0,1),IF(COUNTIF(INDIRECT(W34),(OFFSET(INDIRECT(W33),1,5)))>0,OFFSET(INDIRECT(W33),1,1),BlankMatchCompetitorText)),AwaitingMatchCompetitorText))","v":""},null,null,null,null,{"$f":"IF(AC34=NormalWinState,AND(AC35=NormalLoseState,AB34>AB35),TRUE)","v":true},"*",{"$f":"AH32","v":24},{"$f":"IF(AE34=\"*\",IF(AND(OFFSET(INDIRECT(AE33),0,0)>0,NOT(ISNA(OFFSET(INDIRECT(AE33),0,1)))),OFFSET(INDIRECT(AE33),0,1),UnsetMatchCompetitorText),IF(OFFSET(INDIRECT(AE33),2,5)>0,IF(COUNTIF(INDIRECT(AE34),(OFFSET(INDIRECT(AE33),0,5)))>0,OFFSET(INDIRECT(AE33),0,1),IF(COUNTIF(INDIRECT(AE34),(OFFSET(INDIRECT(AE33),1,5)))>0,OFFSET(INDIRECT(AE33),1,1),BlankMatchCompetitorText)),AwaitingMatchCompetitorText))","v":"Sašo MEŽEK"},null,null,null,null,{"$f":"IF(AK34=NormalWinState,AND(AK35=NormalLoseState,AJ34>AJ35),TRUE)","v":true}]
[null,null,null,null,null,null,{"$f":"CELL(\"address\",OFFSET($A$5,L32,0))","v":"$A$11"},null,{"$f":"IF(G36=\"*\",IF(AND(OFFSET(INDIRECT(G35),0,0)>0,NOT(ISNA(OFFSET(INDIRECT(G35),0,1)))),OFFSET(INDIRECT(G35),0,1),UnsetMatchCompetitorText),IF(OFFSET(INDIRECT(G35),2,5)>0,IF(COUNTIF(INDIRECT(G36),(OFFSET(INDIRECT(G35),0,5)))>0,OFFSET(INDIRECT(G35),0,1),IF(COUNTIF(INDIRECT(G36),(OFFSET(INDIRECT(G35),1,5)))>0,OFFSET(INDIRECT(G35),1,1),BlankMatchCompetitorText)),AwaitingMatchCompetitorText))","v":"Tomaž BENEDIČIČ"},null,null,0,"L",{"$f":"IF(M35=NormalWinState,AND(M34=NormalLoseState,L35>L34),TRUE)","v":true},{"$f":"CELL(\"address\",OFFSET($A$5,T32,0))","v":"$A$10"},null,{"$f":"IF(O36=\"*\",IF(AND(OFFSET(INDIRECT(O35),0,0)>0,NOT(ISNA(OFFSET(INDIRECT(O35),0,1)))),OFFSET(INDIRECT(O35),0,1),UnsetMatchCompetitorText),IF(OFFSET(INDIRECT(O35),2,5)>0,IF(COUNTIF(INDIRECT(O36),(OFFSET(INDIRECT(O35),0,5)))>0,OFFSET(INDIRECT(O35),0,1),IF(COUNTIF(INDIRECT(O36),(OFFSET(INDIRECT(O35),1,5)))>0,OFFSET(INDIRECT(O35),1,1),BlankMatchCompetitorText)),AwaitingMatchCompetitorText))","v":"Lovro KOKOT"},null,null,null,null,{"$f":"IF(U35=NormalWinState,AND(U34=NormalLoseState,T35>T34),TRUE)","v":true},{"$f":"CELL(\"address\",OFFSET($A$5,AB32,0))","v":"$A$9"},null,{"$f":"IF(W36=\"*\",IF(AND(OFFSET(INDIRECT(W35),0,0)>0,NOT(ISNA(OFFSET(INDIRECT(W35),0,1)))),OFFSET(INDIRECT(W35),0,1),UnsetMatchCompetitorText),IF(OFFSET(INDIRECT(W35),2,5)>0,IF(COUNTIF(INDIRECT(W36),(OFFSET(INDIRECT(W35),0,5)))>0,OFFSET(INDIRECT(W35),0,1),IF(COUNTIF(INDIRECT(W36),(OFFSET(INDIRECT(W35),1,5)))>0,OFFSET(INDIRECT(W35),1,1),BlankMatchCompetitorText)),AwaitingMatchCompetitorText))","v":"Nino PORIČ"},null,null,null,null,{"$f":"IF(AC35=NormalWinState,AND(AC34=NormalLoseState,AB35>AB34),TRUE)","v":true},{"$f":"CELL(\"address\",OFFSET($A$5,AJ32,0))","v":"$A$12"},null,{"$f":"IF(AE36=\"*\",IF(AND(OFFSET(INDIRECT(AE35),0,0)>0,NOT(ISNA(OFFSET(INDIRECT(AE35),0,1)))),OFFSET(INDIRECT(AE35),0,1),UnsetMatchCompetitorText),IF(OFFSET(INDIRECT(AE35),2,5)>0,IF(COUNTIF(INDIRECT(AE36),(OFFSET(INDIRECT(AE35),0,5)))>0,OFFSET(INDIRECT(AE35),0,1),IF(COUNTIF(INDIRECT(AE36),(OFFSET(INDIRECT(AE35),1,5)))>0,OFFSET(INDIRECT(AE35),1,1),BlankMatchCompetitorText)),AwaitingMatchCompetitorText))","v":""},null,null,null,null,{"$f":"IF(AK35=NormalWinState,AND(AK34=NormalLoseState,AJ35>AJ34),TRUE)","v":true}]
[null,null,null,null,null,null,"*",8,"11:32:00","12:29:00",{"$f":"IF(ISBLANK(I36),\"\",IF(ISBLANK(J36),CurrentTime-I36,J36-I36))","v":"00:57:00"},"F",{"$f":"IF(AND(COUNTIF(FinishedMatchStates,L36),NOT(ISNA(VLOOKUP(M34,MatchCompetitorStateCodes,1,FALSE))),NOT(ISNA(VLOOKUP(M35,MatchCompetitorStateCodes,1,FALSE))),COUNTIF(WinStates,M34)+COUNTIF(WinStates,M35)<=1,COUNTIF(LoseStates,M34)+COUNTIF(LoseStates,M35)<=1,IF(M34=NormalWinState,AND(M35=NormalLoseState,L34>L35),TRUE),IF(M35=NormalWinState,AND(M34=NormalLoseState,L35>L34),TRUE),NOT(ISBLANK(L33)),NOT(ISBLANK(I33)),NOT(ISBLANK(I36)),NOT(ISBLANK(J36)),H33>0),1,IF(COUNTIF(FinishedMatchStates,L36)>0,-1,0))","v":1},null,"*",null,null,null,{"$f":"IF(ISBLANK(Q36),\"\",IF(ISBLANK(R36),CurrentTime-Q36,R36-Q36))","v":""},null,{"$f":"IF(AND(COUNTIF(FinishedMatchStates,T36),NOT(ISNA(VLOOKUP(U34,MatchCompetitorStateCodes,1,FALSE))),NOT(ISNA(VLOOKUP(U35,MatchCompetitorStateCodes,1,FALSE))),COUNTIF(WinStates,U34)+COUNTIF(WinStates,U35)<=1,COUNTIF(LoseStates,U34)+COUNTIF(LoseStates,U35)<=1,IF(U34=NormalWinState,AND(U35=NormalLoseState,T34>T35),TRUE),IF(U35=NormalWinState,AND(U34=NormalLoseState,T35>T34),TRUE),NOT(ISBLANK(T33)),NOT(ISBLANK(Q33)),NOT(ISBLANK(Q36)),NOT(ISBLANK(R36)),P33>0),1,IF(COUNTIF(FinishedMatchStates,T36)>0,-1,0))","v":0},null,"*",null,null,null,{"$f":"IF(ISBLANK(Y36),\"\",IF(ISBLANK(Z36),CurrentTime-Y36,Z36-Y36))","v":""},null,{"$f":"IF(AND(COUNTIF(FinishedMatchStates,AB36),NOT(ISNA(VLOOKUP(AC34,MatchCompetitorStateCodes,1,FALSE))),NOT(ISNA(VLOOKUP(AC35,MatchCompetitorStateCodes,1,FALSE))),COUNTIF(WinStates,AC34)+COUNTIF(WinStates,AC35)<=1,COUNTIF(LoseStates,AC34)+COUNTIF(LoseStates,AC35)<=1,IF(AC34=NormalWinState,AND(AC35=NormalLoseState,AB34>AB35),TRUE),IF(AC35=NormalWinState,AND(AC34=NormalLoseState,AB35>AB34),TRUE),NOT(ISBLANK(AB33)),NOT(ISBLANK(Y33)),NOT(ISBLANK(Y36)),NOT(ISBLANK(Z36)),X33>0),1,IF(COUNTIF(FinishedMatchStates,AB36)>0,-1,0))","v":0},null,"*",null,null,null,{"$f":"IF(ISBLANK(AG36),\"\",IF(ISBLANK(AH36),CurrentTime-AG36,AH36-AG36))","v":""},null,{"$f":"IF(AND(COUNTIF(FinishedMatchStates,AJ36),NOT(ISNA(VLOOKUP(AK34,MatchCompetitorStateCodes,1,FALSE))),NOT(ISNA(VLOOKUP(AK35,MatchCompetitorStateCodes,1,FALSE))),COUNTIF(WinStates,AK34)+COUNTIF(WinStates,AK35)<=1,COUNTIF(LoseStates,AK34)+COUNTIF(LoseStates,AK35)<=1,IF(AK34=NormalWinState,AND(AK35=NormalLoseState,AJ34>AJ35),TRUE),IF(AK35=NormalWinState,AND(AK34=NormalLoseState,AJ35>AJ34),TRUE),NOT(ISBLANK(AJ33)),NOT(ISBLANK(AG33)),NOT(ISBLANK(AG36)),NOT(ISBLANK(AH36)),AF33>0),1,IF(COUNTIF(FinishedMatchStates,AJ36)>0,-1,0))","v":0}]
[]
[null,null,null,null,null,null,{"$f":"G32","v":1},{"$f":"H32+1","v":7},{"$f":"I32","v":1},{"$f":"((H38-1)*$B$3)+I38","v":25},7,1,null,null,{"$f":"G38","v":1},{"$f":"H38","v":7},{"$f":"I38+1","v":2},{"$f":"((P38-1)*$B$3)+Q38","v":26},6,2,null,null,{"$f":"O38","v":1},{"$f":"P38","v":7},{"$f":"Q38+1","v":3},{"$f":"((X38-1)*$B$3)+Y38","v":27},5,3,null,null,{"$f":"W38","v":1},{"$f":"X38","v":7},{"$f":"Y38+1","v":4},{"$f":"((AF38-1)*$B$3)+AG38","v":28},4,8]
[null,null,null,null,null,null,{"$f":"CELL(\"address\",OFFSET($A$5,K38,0))","v":"$A$12"},{"$f":"IF(AND(NOT(ISBLANK(I40)),I40<>UnsetMatchCompetitorText,I40<>AwaitingMatchCompetitorText,NOT(ISBLANK(I41)),I41<>UnsetMatchCompetitorText,I41<>AwaitingMatchCompetitorText),1,IF(AND(I40<>AwaitingMatchCompetitorText,I41<>AwaitingMatchCompetitorText),-1,0))","v":1},"09:00:00",null,null,null,null,null,{"$f":"CELL(\"address\",OFFSET($A$5,S38,0))","v":"$A$11"},{"$f":"IF(AND(NOT(ISBLANK(Q40)),Q40<>UnsetMatchCompetitorText,Q40<>AwaitingMatchCompetitorText,NOT(ISBLANK(Q41)),Q41<>UnsetMatchCompetitorText,Q41<>AwaitingMatchCompetitorText),1,IF(AND(Q40<>AwaitingMatchCompetitorText,Q41<>AwaitingMatchCompetitorText),-1,0))","v":1},"09:00:00",null,null,null,null,null,{"$f":"CELL(\"address\",OFFSET($A$5,AA38,0))","v":"$A$10"},{"$f":"IF(AND(NOT(ISBLANK(Y40)),Y40<>UnsetMatchCompetitorText,Y40<>AwaitingMatchCompetitorText,NOT(ISBLANK(Y41)),Y41<>UnsetMatchCompetitorText,Y41<>AwaitingMatchCompetitorText),1,IF(AND(Y40<>AwaitingMatchCompetitorText,Y41<>AwaitingMatchCompetitorText),-1,0))","v":1},"09:00:00",null,null,null,null,null,{"$f":"CELL(\"address\",OFFSET($A$5,AI38,0))","v":"$A$9"},{"$f":"IF(AND(NOT(ISBLANK(AG40)),AG40<>UnsetMatchCompetitorText,AG40<>AwaitingMatchCompetitorText,NOT(ISBLANK(AG41)),AG41<>UnsetMatchCompetitorText,AG41<>AwaitingMatchCompetitorText),1,IF(AND(AG40<>AwaitingMatchCompetitorText,AG41<>AwaitingMatchCompetitorText),-1,0))","v":1},"09:00:00",null,null,5]
[null,null,null,null,null,null,"*",{"$f":"J38","v":25},{"$f":"IF(G40=\"*\",IF(AND(OFFSET(INDIRECT(G39),0,0)>0,NOT(ISNA(OFFSET(INDIRECT(G39),0,1)))),OFFSET(INDIRECT(G39),0,1),UnsetMatchCompetitorText),IF(OFFSET(INDIRECT(G39),2,5)>0,IF(COUNTIF(INDIRECT(G40),(OFFSET(INDIRECT(G39),0,5)))>0,OFFSET(INDIRECT(G39),0,1),IF(COUNTIF(INDIRECT(G40),(OFFSET(INDIRECT(G39),1,5)))>0,OFFSET(INDIRECT(G39),1,1),BlankMatchCompetitorText)),AwaitingMatchCompetitorText))","v":""},null,null,null,null,{"$f":"IF(M40=NormalWinState,AND(M41=NormalLoseState,L40>L41),TRUE)","v":true},"*",{"$f":"R38","v":26},{"$f":"IF(O40=\"*\",IF(AND(OFFSET(INDIRECT(O39),0,0)>0,NOT(ISNA(OFFSET(INDIRECT(O39),0,1)))),OFFSET(INDIRECT(O39),0,1),UnsetMatchCompetitorText),IF(OFFSET(INDIRECT(O39),2,5)>0,IF(COUNTIF(INDIRECT(O40),(OFFSET(INDIRECT(O39),0,5)))>0,OFFSET(INDIRECT(O39),0,1),IF(COUNTIF(INDIRECT(O40),(OFFSET(INDIRECT(O39),1,5)))>0,OFFSET(INDIRECT(O39),1,1),BlankMatchCompetitorText)),AwaitingMatchCompetitorText))","v":"Tomaž BENEDIČIČ"},null,null,null,null,{"$f":"IF(U40=NormalWinState,AND(U41=NormalLoseState,T40>T41),TRUE)","v":true},"*",{"$f":"Z38","v":27},{"$f":"IF(W40=\"*\",IF(AND(OFFSET(INDIRECT(W39),0,0)>0,NOT(ISNA(OFFSET(INDIRECT(W39),0,1)))),OFFSET(INDIRECT(W39),0,1),UnsetMatchCompetitorText),IF(OFFSET(INDIRECT(W39),2,5)>0,IF(COUNTIF(INDIRECT(W40),(OFFSET(INDIRECT(W39),0,5)))>0,OFFSET(INDIRECT(W39),0,1),IF(COUNTIF(INDIRECT(W40),(OFFSET(INDIRECT(W39),1,5)))>0,OFFSET(INDIRECT(W39),1,1),BlankMatchCompetitorText)),AwaitingMatchCompetitorText))","v":"Lovro KOKOT"},null,null,null,null,{"$f":"IF(AC40=NormalWinState,AND(AC41=NormalLoseState,AB40>AB41),TRUE)","v":true},"*",{"$f":"AH38","v":28},{"$f":"IF(AE40=\"*\",IF(AND(OFFSET(INDIRECT(AE39),0,0)>0,NOT(ISNA(OFFSET(INDIRECT(AE39),0,1)))),OFFSET(INDIRECT(AE39),0,1),UnsetMatchCompetitorText),IF(OFFSET(INDIRECT(AE39),2,5)>0,IF(COUNTIF(INDIRECT(AE40),(OFFSET(INDIRECT(AE39),0,5)))>0,OFFSET(INDIRECT(AE39),0,1),IF(COUNTIF(INDIRECT(AE40),(OFFSET(INDIRECT(AE39),1,5)))>0,OFFSET(INDIRECT(AE39),1,1),BlankMatchCompetitorText)),AwaitingMatchCompetitorText))","v":"Nino PORIČ"},null,null,null,"WO",{"$f":"IF(AK40=NormalWinState,AND(AK41=NormalLoseState,AJ40>AJ41),TRUE)","v":true}]
[null,null,null,null,null,null,{"$f":"CELL(\"address\",OFFSET($A$5,L38,0))","v":"$A$6"},null,{"$f":"IF(G42=\"*\",IF(AND(OFFSET(INDIRECT(G41),0,0)>0,NOT(ISNA(OFFSET(INDIRECT(G41),0,1)))),OFFSET(INDIRECT(G41),0,1),UnsetMatchCompetitorText),IF(OFFSET(INDIRECT(G41),2,5)>0,IF(COUNTIF(INDIRECT(G42),(OFFSET(INDIRECT(G41),0,5)))>0,OFFSET(INDIRECT(G41),0,1),IF(COUNTIF(INDIRECT(G42),(OFFSET(INDIRECT(G41),1,5)))>0,OFFSET(INDIRECT(G41),1,1),BlankMatchCompetitorText)),AwaitingMatchCompetitorText))","v":"Franci ČUČNIK"},null,null,null,null,{"$f":"IF(M41=NormalWinState,AND(M40=NormalLoseState,L41>L40),TRUE)","v":true},{"$f":"CELL(\"address\",OFFSET($A$5,T38,0))","v":"$A$7"},null,{"$f":"IF(O42=\"*\",IF(AND(OFFSET(INDIRECT(O41),0,0)>0,NOT(ISNA(OFFSET(INDIRECT(O41),0,1)))),OFFSET(INDIRECT(O41),0,1),UnsetMatchCompetitorText),IF(OFFSET(INDIRECT(O41),2,5)>0,IF(COUNTIF(INDIRECT(O42),(OFFSET(INDIRECT(O41),0,5)))>0,OFFSET(INDIRECT(O41),0,1),IF(COUNTIF(INDIRECT(O42),(OFFSET(INDIRECT(O41),1,5)))>0,OFFSET(INDIRECT(O41),1,1),BlankMatchCompetitorText)),AwaitingMatchCompetitorText))","v":""},null,null,null,null,{"$f":"IF(U41=NormalWinState,AND(U40=NormalLoseState,T41>T40),TRUE)","v":true},{"$f":"CELL(\"address\",OFFSET($A$5,AB38,0))","v":"$A$8"},null,{"$f":"IF(W42=\"*\",IF(AND(OFFSET(INDIRECT(W41),0,0)>0,NOT(ISNA(OFFSET(INDIRECT(W41),0,1)))),OFFSET(INDIRECT(W41),0,1),UnsetMatchCompetitorText),IF(OFFSET(INDIRECT(W41),2,5)>0,IF(COUNTIF(INDIRECT(W42),(OFFSET(INDIRECT(W41),0,5)))>0,OFFSET(INDIRECT(W41),0,1),IF(COUNTIF(INDIRECT(W42),(OFFSET(INDIRECT(W41),1,5)))>0,OFFSET(INDIRECT(W41),1,1),BlankMatchCompetitorText)),AwaitingMatchCompetitorText))","v":""},null,null,null,null,{"$f":"IF(AC41=NormalWinState,AND(AC40=NormalLoseState,AB41>AB40),TRUE)","v":true},{"$f":"CELL(\"address\",OFFSET($A$5,AJ38,0))","v":"$A$13"},null,{"$f":"IF(AE42=\"*\",IF(AND(OFFSET(INDIRECT(AE41),0,0)>0,NOT(ISNA(OFFSET(INDIRECT(AE41),0,1)))),OFFSET(INDIRECT(AE41),0,1),UnsetMatchCompetitorText),IF(OFFSET(INDIRECT(AE41),2,5)>0,IF(COUNTIF(INDIRECT(AE42),(OFFSET(INDIRECT(AE41),0,5)))>0,OFFSET(INDIRECT(AE41),0,1),IF(COUNTIF(INDIRECT(AE42),(OFFSET(INDIRECT(AE41),1,5)))>0,OFFSET(INDIRECT(AE41),1,1),BlankMatchCompetitorText)),AwaitingMatchCompetitorText))","v":"Sašo MEŽEK"},null,null,null,"DNS",{"$f":"IF(AK41=NormalWinState,AND(AK40=NormalLoseState,AJ41>AJ40),TRUE)","v":true}]
[null,null,null,null,null,null,"*",null,null,null,{"$f":"IF(ISBLANK(I42),\"\",IF(ISBLANK(J42),CurrentTime-I42,J42-I42))","v":""},null,{"$f":"IF(AND(COUNTIF(FinishedMatchStates,L42),NOT(ISNA(VLOOKUP(M40,MatchCompetitorStateCodes,1,FALSE))),NOT(ISNA(VLOOKUP(M41,MatchCompetitorStateCodes,1,FALSE))),COUNTIF(WinStates,M40)+COUNTIF(WinStates,M41)<=1,COUNTIF(LoseStates,M40)+COUNTIF(LoseStates,M41)<=1,IF(M40=NormalWinState,AND(M41=NormalLoseState,L40>L41),TRUE),IF(M41=NormalWinState,AND(M40=NormalLoseState,L41>L40),TRUE),NOT(ISBLANK(L39)),NOT(ISBLANK(I39)),NOT(ISBLANK(I42)),NOT(ISBLANK(J42)),H39>0),1,IF(COUNTIF(FinishedMatchStates,L42)>0,-1,0))","v":0},null,"*",null,null,null,{"$f":"IF(ISBLANK(Q42),\"\",IF(ISBLANK(R42),CurrentTime-Q42,R42-Q42))","v":""},null,{"$f":"IF(AND(COUNTIF(FinishedMatchStates,T42),NOT(ISNA(VLOOKUP(U40,MatchCompetitorStateCodes,1,FALSE))),NOT(ISNA(VLOOKUP(U41,MatchCompetitorStateCodes,1,FALSE))),COUNTIF(WinStates,U40)+COUNTIF(WinStates,U41)<=1,COUNTIF(LoseStates,U40)+COUNTIF(LoseStates,U41)<=1,IF(U40=NormalWinState,AND(U41=NormalLoseState,T40>T41),TRUE),IF(U41=NormalWinState,AND(U40=NormalLoseState,T41>T40),TRUE),NOT(ISBLANK(T39)),NOT(ISBLANK(Q39)),NOT(ISBLANK(Q42)),NOT(ISBLANK(R42)),P39>0),1,IF(COUNTIF(FinishedMatchStates,T42)>0,-1,0))","v":0},null,"*",null,null,null,{"$f":"IF(ISBLANK(Y42),\"\",IF(ISBLANK(Z42),CurrentTime-Y42,Z42-Y42))","v":""},null,{"$f":"IF(AND(COUNTIF(FinishedMatchStates,AB42),NOT(ISNA(VLOOKUP(AC40,MatchCompetitorStateCodes,1,FALSE))),NOT(ISNA(VLOOKUP(AC41,MatchCompetitorStateCodes,1,FALSE))),COUNTIF(WinStates,AC40)+COUNTIF(WinStates,AC41)<=1,COUNTIF(LoseStates,AC40)+COUNTIF(LoseStates,AC41)<=1,IF(AC40=NormalWinState,AND(AC41=NormalLoseState,AB40>AB41),TRUE),IF(AC41=NormalWinState,AND(AC40=NormalLoseState,AB41>AB40),TRUE),NOT(ISBLANK(AB39)),NOT(ISBLANK(Y39)),NOT(ISBLANK(Y42)),NOT(ISBLANK(Z42)),X39>0),1,IF(COUNTIF(FinishedMatchStates,AB42)>0,-1,0))","v":0},null,"*",null,"10:22:00","10:23:00",{"$f":"IF(ISBLANK(AG42),\"\",IF(ISBLANK(AH42),CurrentTime-AG42,AH42-AG42))","v":"00:01:00"},"F",{"$f":"IF(AND(COUNTIF(FinishedMatchStates,AJ42),NOT(ISNA(VLOOKUP(AK40,MatchCompetitorStateCodes,1,FALSE))),NOT(ISNA(VLOOKUP(AK41,MatchCompetitorStateCodes,1,FALSE))),COUNTIF(WinStates,AK40)+COUNTIF(WinStates,AK41)<=1,COUNTIF(LoseStates,AK40)+COUNTIF(LoseStates,AK41)<=1,IF(AK40=NormalWinState,AND(AK41=NormalLoseState,AJ40>AJ41),TRUE),IF(AK41=NormalWinState,AND(AK40=NormalLoseState,AJ41>AJ40),TRUE),NOT(ISBLANK(AJ39)),NOT(ISBLANK(AG39)),NOT(ISBLANK(AG42)),NOT(ISBLANK(AH42)),AF39>0),1,IF(COUNTIF(FinishedMatchStates,AJ42)>0,-1,0))","v":1}]

{"sheet":"Finalna skupina","index":7,"n_rows":57,"n_cols":75,"rows_kept":57,"cut":false,"hidden":false,"merged":[[44,9,44,10],[45,7,46,7],[45,8,45,10],[46,8,46,10],[38,9,38,10],[39,7,40,7],[39,8,39,10],[40,8,40,10],[41,17,41,18],[42,15,43,15],[42,16,42,18],[43,16,43,18],[32,9,32,10],[33,7,34,7],[33,8,33,10],[34,8,34,10],[35,25,35,26],[36,23,37,23],[36,24,36,26],[37,24,37,26],[30,15,31,15],[30,16,30,18],[31,16,31,18],[20,9,20,10],[21,7,22,7],[21,8,21,10],[22,8,22,10],[26,9,26,10],[27,7,28,7],[27,8,27,10],[28,8,28,10],[29,17,29,18],[23,33,23,34],[24,31,25,31],[24,32,24,34],[25,32,25,34],[14,9,14,10],[15,7,16,7],[15,8,15,10],[16,8,16,10],[17,17,17,18],[18,15,19,15],[18,16,18,18],[19,16,19,18],[12,23,13,23],[12,24,12,26],[13,24,13,26],[2,9,2,10],[3,7,4,7],[3,8,3,10],[4,8,4,10],[5,17,5,18],[6,15,7,15],[6,16,6,18],[7,16,7,18],[8,9,8,10],[9,7,10,7],[9,8,9,10],[10,8,10,10],[11,25,11,26]]}
["Nastavitve",null,null,null,null,null,null,null,null,null,null,null,null,null,null,null,null,null,null,null,null,null,null,null,null,null,null,null,null,null,null,null,null,null,null,null,null,null,null,null,null,null,null,null,null,null,null,null,null,null,null,null,"Match","Row","Col","Address","Group","Match nr.","Table","Scheduled time","Target","Notes","Start time","End time","Duration","P1 Name","P1 Code","P1 Score","P1 State","P2 Name","P2 Code","P2 Score","P2 State","Match State","Is Valid"]
["Skupina","F",null,null,null,null,1,null,null,null,null,null,null,null,null,null,null,null,null,null,null,null,null,null,null,null,null,null,null,null,null,null,null,null,null,null,null,null,null,null,null,null,null,null,null,null,null,null,null,null,null,null,1,{"$f":"ROW(H4)","v":4},{"$f":"COLUMN(H4)","v":8},{"$f":"ADDRESS(BB2,BC2)","v":"$H$4"},{"$f":"CONCATENATE($B$2)","v":"F"},{"$f":"INDIRECT(BD2)","v":1},{"$f":"CONCATENATE(OFFSET(INDIRECT(BD2),2,0))","v":"1"},{"$f":"OFFSET(INDIRECT(BD2),-1,1)","v":"00:00:00"},{"$f":"OFFSET(INDIRECT(BD2),-1,4)","v":7},{"$f":"CONCATENATE(OFFSET(INDIRECT(BD2),-1,2))","v":""},{"$f":"OFFSET(INDIRECT(BD2),2,1)","v":"16:00:00"},{"$f":"OFFSET(INDIRECT(BD2),2,2)","v":"17:05:00"},{"$f":"OFFSET(INDIRECT(BD2),2,3)","v":"01:05:00"},{"$f":"OFFSET(INDIRECT(BD2),0,1)","v":"Mitja GRADIŠNIK"},{"$f":"VLOOKUP(BN2,AnnouncementListCompetitors,6,FALSE)","v":92},{"$f":"OFFSET(INDIRECT(BD2),0,4)","v":7},{"$f":"OFFSET(INDIRECT(BD2),0,5)","v":"W"},{"$f":"OFFSET(INDIRECT(BD2),1,1)","v":"Aleksander RAIŠIČ"},{"$f":"VLOOKUP(BR2,AnnouncementListCompetitors,6,FALSE)","v":220},{"$f":"OFFSET(INDIRECT(BD2),1,4)","v":3},{"$f":"OFFSET(INDIRECT(BD2),1,5)","v":"L"},{"$f":"OFFSET(INDIRECT(BD2),2,4)","v":"F"},{"$f":"IF(OFFSET(INDIRECT(BD2),2,5)=1,TRUE,FALSE)","v":false}]
["Št. Skupin",1,null,null,null,null,{"$f":"CELL(\"address\",OFFSET($A$23,(G2-1)*2+1,0))","v":"$A$24"},{"$f":"IF(AND(NOT(ISBLANK(I4)),I4<>UnsetMatchCompetitorText,I4<>AwaitingMatchCompetitorText,NOT(ISBLANK(I5)),I5<>UnsetMatchCompetitorText,I5<>AwaitingMatchCompetitorText),1,IF(AND(I4<>AwaitingMatchCompetitorText,I5<>AwaitingMatchCompetitorText),-1,0))","v":1},null,null,null,7,null,null,null,null,null,null,null,null,null,null,null,null,null,null,null,null,null,null,null,null,null,null,null,null,null,null,null,null,null,null,null,null,null,null,null,null,null,null,null,null,2,{"$f":"BB2+6","v":10},{"$f":"BC2","v":8},"$H$10",{"$f":"CONCATENATE($B$2)","v":"F"},2,"2","00:00:00",7,"","16:00:00","17:17:00","01:17:00","Ana GRADIŠNIK",551,7,"W","Damjan KEREP",300,1,"L","F",false]
[null,null,null,null,null,null,"*",{"$f":"G2","v":1},{"$f":"IF(G4=\"*\",IF(AND(OFFSET(INDIRECT(G3),0,0)>0,NOT(ISNA(OFFSET(INDIRECT(G3),0,1)))),OFFSET(INDIRECT(G3),0,1),UnsetMatchCompetitorText),IF(OFFSET(INDIRECT(G3),2,5)>0,IF(COUNTIF(INDIRECT(G4),(OFFSET(INDIRECT(G3),0,5)))>0,OFFSET(INDIRECT(G3),0,1),IF(COUNTIF(INDIRECT(G4),(OFFSET(INDIRECT(G3),1,5)))>0,OFFSET(INDIRECT(G3),1,1),BlankMatchCompetitorText)),AwaitingMatchCompetitorText))","v":"Mitja GRADIŠNIK"},null,null,7,"W",true,null,null,null,null,null,null,null,null,null,null,null,null,null,null,null,null,null,null,null,null,null,null,null,null,null,null,null,null,null,null,null,null,null,null,null,null,null,null,3,16,8,"$H$16","F",3,"3","00:00:00",7,"","16:00:00","18:06:00","02:06:00","Denis GODEŠA",723,7,"W","Franci ČUČNIK",891,5,"L","F",false]
["Žreb","Tekmovalec",null,null,null,null,{"$f":"CELL(\"address\",OFFSET($A$23,(G2-1)*2+2,0))","v":"$A$25"},null,{"$f":"Sheet1!Q18","v":"Aleksander RAIŠIČ"},null,null,3,"L",true,9,null,null,null,null,null,null,null,null,null,null,null,null,null,null,null,null,null,null,null,null,null,null,null,null,null,null,null,null,null,null,null,null,null,null,null,null,null,4,22,8,"$H$22","F",4,"4","00:00:00",7,"","16:00:00","17:28:00","01:28:00","Igor BAJSIČ",799,5,"L","Klemen GRADIŠNIK",612,7,"W","F",false]
[1,{"$f":"VLOOKUP(A6,DrawSheetPositionCompetitorsFinalPreQualified,2,FALSE)","v":"Mitja GRADIŠNIK"},null,null,null,null,"*",1,"16:00:00","17:05:00",{"$f":"IF(ISBLANK(I6),\"\",IF(ISBLANK(J6),CurrentTime-I6,J6-I6))","v":"01:05:00"},"F",{"$f":"IF(AND(COUNTIF(FinishedMatchStates,L6),NOT(ISNA(VLOOKUP(M4,MatchCompetitorStateCodes,1,FALSE))),NOT(ISNA(VLOOKUP(M5,MatchCompetitorStateCodes,1,FALSE))),COUNTIF(WinStates,M4)+COUNTIF(WinStates,M5)<=1,COUNTIF(LoseStates,M4)+COUNTIF(LoseStates,M5)<=1,IF(M4=NormalWinState,AND(M5=NormalLoseState,L4>L5),TRUE),IF(M5=NormalWinState,AND(M4=NormalLoseState,L5>L4),TRUE),NOT(ISBLANK(L3)),NOT(ISBLANK(I3)),NOT(ISBLANK(I6)),NOT(ISBLANK(J6)),H3>0),1,IF(COUNTIF(FinishedMatchStates,L6)>0,-1,0))","v":-1},null,{"$f":"CELL(\"address\",H4)","v":"$H$4"},{"$f":"IF(AND(NOT(ISBLANK(Q7)),Q7<>UnsetMatchCompetitorText,Q7<>AwaitingMatchCompetitorText,NOT(ISBLANK(Q8)),Q8<>UnsetMatchCompetitorText,Q8<>AwaitingMatchCompetitorText),1,IF(AND(Q7<>AwaitingMatchCompetitorText,Q8<>AwaitingMatchCompetitorText),-1,0))","v":1},null,null,null,7,null,null,null,null,null,null,null,null,null,null,null,null,null,null,null,null,null,null,null,null,null,null,null,null,null,null,null,null,null,null,null,null,5,28,8,"$H$28","F",5,"5","00:00:00",7,"","16:00:00","17:03:00","01:03:00","Matjaž ERČULJ",80,7,"W","Kristijan HAMZOVSKI",774,3,"L","F",false]
[4,"Denis GODEŠA",null,null,null,null,null,null,null,null,null,null,null,null,"WinStates",{"$f":"O5","v":9},{"$f":"I4","v":"Mitja GRADIŠNIK"},null,null,7,"W",true,null,null,null,null,null,null,null,null,null,null,null,null,null,null,null,null,null,null,null,null,null,null,null,null,null,null,null,null,null,null,6,34,8,"$H$34","F",6,"6","00:00:00",7,"","16:00:00","17:48:00","01:48:00","Matej BRAJKOVIČ",440,6,"L","Miha ZAJC",589,7,"W","F",false]
[5,"Damjan KEREP",null,null,null,null,{"$f":"G2+1","v":2},null,null,null,null,null,null,null,{"$f":"CELL(\"address\",H10)","v":"$H$10"},null,{"$f":"I10","v":"Ana GRADIŠNIK"},null,null,4,"L",true,null,null,null,null,null,null,null,null,null,null,null,null,null,null,null,null,null,null,null,null,null,null,null,null,null,null,null,null,null,null,7,40,8,"$H$40","F",7,"7","00:00:00",7,"","16:00:00","16:56:00","00:56:00","Miha ŽAGAR",2,2,"L","Nino PORIČ",866,7,"W","F",false]
[8,"Klemen GRADIŠNIK",null,null,null,null,{"$f":"CELL(\"address\",OFFSET($A$23,(G8-1)*2+1,0))","v":"$A$26"},{"$f":"IF(AND(NOT(ISBLANK(I10)),I10<>UnsetMatchCompetitorText,I10<>AwaitingMatchCompetitorText,NOT(ISBLANK(I11)),I11<>UnsetMatchCompetitorText,I11<>AwaitingMatchCompetitorText),1,IF(AND(I10<>AwaitingMatchCompetitorText,I11<>AwaitingMatchCompetitorText),-1,0))","v":1},null,null,null,7,null,null,"WinStates",5,"17:28:00","18:28:00",{"$f":"IF(ISBLANK(Q9),\"\",IF(ISBLANK(R9),CurrentTime-Q9,R9-Q9))","v":"01:00:00"},"F",{"$f":"IF(AND(COUNTIF(FinishedMatchStates,T9),NOT(ISNA(VLOOKUP(U7,MatchCompetitorStateCodes,1,FALSE))),NOT(ISNA(VLOOKUP(U8,MatchCompetitorStateCodes,1,FALSE))),COUNTIF(WinStates,U7)+COUNTIF(WinStates,U8)<=1,COUNTIF(LoseStates,U7)+COUNTIF(LoseStates,U8)<=1,IF(U7=NormalWinState,AND(U8=NormalLoseState,T7>T8),TRUE),IF(U8=NormalWinState,AND(U7=NormalLoseState,T8>T7),TRUE),NOT(ISBLANK(T6)),NOT(ISBLANK(Q6)),NOT(ISBLANK(Q9)),NOT(ISBLANK(R9)),P6>0),1,IF(COUNTIF(FinishedMatchStates,T9)>0,-1,0))","v":-1},null,null,null,null,null,null,null,null,null,null,null,null,null,null,null,null,null,null,null,null,null,null,null,null,null,null,null,null,null,null,null,8,46,8,"$H$46","F",8,"","00:00:00",7,"","16:00:00","17:30:00","01:30:00","Robert REDNAK",178,3,"L","Jurij POTOČNIK",487,7,"W","F",false]
[9,"Matjaž ERČULJ",null,null,null,null,"*",{"$f":"G8","v":2},{"$f":"Sheet1!Q19","v":"Ana GRADIŠNIK"},null,null,7,"W",true,null,null,null,null,null,null,null,null,null,null,null,null,null,null,null,null,null,null,null,null,null,null,null,null,null,null,null,null,null,null,null,null,null,null,null,null,null,null,17,{"$f":"ROW(P7)","v":7},{"$f":"COLUMN(P7)","v":16},"$P$7","F",9,"5","00:00:00",7,"","17:28:00","18:28:00","01:00:00","Mitja GRADIŠNIK",92,7,"W","Ana GRADIŠNIK",551,4,"L","F",false]
[12,"Ana GRADIŠNIK",null,null,null,null,{"$f":"CELL(\"address\",OFFSET($A$23,(G8-1)*2+2,0))","v":"$A$27"},null,{"$f":"Sheet1!Q20","v":"Damjan KEREP"},null,null,1,"L",true,null,null,null,null,null,null,null,null,13,null,null,null,null,null,null,null,null,null,null,null,null,null,null,null,null,null,null,null,null,null,null,null,null,null,null,null,null,null,18,{"$f":"BB10+12","v":19},{"$f":"BC10","v":16},"$P$19","F",10,"4","00:00:00",7,"","18:06:00","19:55:00","01:49:00","Denis GODEŠA",723,7,"W","Klemen GRADIŠNIK",612,6,"L","F",false]
[13,"Miha ZAJC",null,null,null,null,"*",2,"16:00:00","17:17:00",{"$f":"IF(ISBLANK(I12),\"\",IF(ISBLANK(J12),CurrentTime-I12,J12-I12))","v":"01:17:00"},"F",{"$f":"IF(AND(COUNTIF(FinishedMatchStates,L12),NOT(ISNA(VLOOKUP(M10,MatchCompetitorStateCodes,1,FALSE))),NOT(ISNA(VLOOKUP(M11,MatchCompetitorStateCodes,1,FALSE))),COUNTIF(WinStates,M10)+COUNTIF(WinStates,M11)<=1,COUNTIF(LoseStates,M10)+COUNTIF(LoseStates,M11)<=1,IF(M10=NormalWinState,AND(M11=NormalLoseState,L10>L11),TRUE),IF(M11=NormalWinState,AND(M10=NormalLoseState,L11>L10),TRUE),NOT(ISBLANK(L9)),NOT(ISBLANK(I9)),NOT(ISBLANK(I12)),NOT(ISBLANK(J12)),H9>0),1,IF(COUNTIF(FinishedMatchStates,L12)>0,-1,0))","v":-1},null,null,null,null,null,null,null,null,null,{"$f":"CELL(\"address\",P7)","v":"$P$7"},{"$f":"IF(AND(NOT(ISBLANK(Y13)),Y13<>UnsetMatchCompetitorText,Y13<>AwaitingMatchCompetitorText,NOT(ISBLANK(Y14)),Y14<>UnsetMatchCompetitorText,Y14<>AwaitingMatchCompetitorText),1,IF(AND(Y13<>AwaitingMatchCompetitorText,Y14<>AwaitingMatchCompetitorText),-1,0))","v":1},null,null,null,7,null,null,null,null,null,null,null,null,null,null,null,null,null,null,null,null,null,null,null,null,null,null,null,null,19,31,16,"$P$31","F",11,"6","00:00:00",7,"","17:49:00","18:52:00","01:03:00","Matjaž ERČULJ",80,7,"W","Miha ZAJC",589,4,"L","F",false]
[16,"Jurij POTOČNIK",null,null,null,null,null,null,null,null,null,null,null,null,null,null,null,null,null,null,null,null,"WinStates",{"$f":"W11","v":13},{"$f":"Q7","v":"Mitja GRADIŠNIK"},null,null,5,"l",true,null,null,null,null,null,null,null,null,null,null,null,null,null,null,null,null,null,null,null,null,null,null,20,43,16,"$P$43","F",12,"","00:00:00",7,"","17:31:00","18:30:00","00:59:00","Nino PORIČ",866,7,"W","Jurij POTOČNIK",487,2,"L","F",false]
[{"$f":"'Skupina 1'!C16","v":""},{"$f":"'Skupina 1'!B16","v":"Kristijan HAMZOVSKI"},null,null,null,null,{"$f":"G8+1","v":3},null,null,null,null,null,null,null,null,null,null,null,null,null,null,null,{"$f":"CELL(\"address\",P19)","v":"$P$19"},null,{"$f":"Q19","v":"Denis GODEŠA"},null,null,7,"w",true,null,null,null,null,null,null,null,null,null,null,null,null,null,null,null,null,null,null,null,null,null,null,25,{"$f":"ROW(X13)","v":13},{"$f":"COLUMN(X13)","v":24},"$X$13","F",13,"5","00:00:00",7,"","19:56:00","21:23:00","01:27:00","Mitja GRADIŠNIK",92,5,"l","Denis GODEŠA",723,7,"w","F",false]
[{"$f":"'Skupina 1'!C17","v":""},{"$f":"'Skupina 1'!B17","v":"Robert REDNAK"},null,null,null,null,{"$f":"CELL(\"address\",OFFSET($A$23,(G14-1)*2+1,0))","v":"$A$28"},{"$f":"IF(AND(NOT(ISBLANK(I16)),I16<>UnsetMatchCompetitorText,I16<>AwaitingMatchCompetitorText,NOT(ISBLANK(I17)),I17<>UnsetMatchCompetitorText,I17<>AwaitingMatchCompetitorText),1,IF(AND(I16<>AwaitingMatchCompetitorText,I17<>AwaitingMatchCompetitorText),-1,0))","v":1},null,null,null,7,null,null,null,null,null,null,null,null,null,null,"WinStates",5,"19:56:00","21:23:00",{"$f":"IF(ISBLANK(Y15),\"\",IF(ISBLANK(Z15),CurrentTime-Y15,Z15-Y15))","v":"01:27:00"},"F",{"$f":"IF(AND(COUNTIF(FinishedMatchStates,AB15),NOT(ISNA(VLOOKUP(AC13,MatchCompetitorStateCodes,1,FALSE))),NOT(ISNA(VLOOKUP(AC14,MatchCompetitorStateCodes,1,FALSE))),COUNTIF(WinStates,AC13)+COUNTIF(WinStates,AC14)<=1,COUNTIF(LoseStates,AC13)+COUNTIF(LoseStates,AC14)<=1,IF(AC13=NormalWinState,AND(AC14=NormalLoseState,AB13>AB14),TRUE),IF(AC14=NormalWinState,AND(AC13=NormalLoseState,AB14>AB13),TRUE),NOT(ISBLANK(AB12)),NOT(ISBLANK(Y12)),NOT(ISBLANK(Y15)),NOT(ISBLANK(Z15)),X12>0),1,IF(COUNTIF(FinishedMatchStates,AB15)>0,-1,0))","v":-1},null,null,null,null,null,null,null,null,null,null,null,null,null,null,null,null,null,null,null,null,null,null,null,26,{"$f":"BB14+24","v":37},{"$f":"BC14","v":24},"$X$37","F",14,"6","00:00:00",7,"","19:56:00","20:52:00","00:56:00","Matjaž ERČULJ",80,7,"W","Nino PORIČ",866,4,"L","F",false]
[{"$f":"'Skupina 2'!C16","v":""},{"$f":"'Skupina 2'!B16","v":"Matej BRAJKOVIČ"},null,null,null,null,"*",{"$f":"G14","v":3},{"$f":"Sheet1!Q21","v":"Denis GODEŠA"},null,null,7,"W",true,null,null,null,null,null,null,null,null,null,null,null,null,null,null,null,null,null,null,null,null,null,null,null,null,null,null,null,null,null,null,null,null,null,null,null,null,null,null,29,{"$f":"ROW(AF25)","v":25},{"$f":"COLUMN(AF25)","v":32},"$AF$25","F",15,"6","00:00:00",7,"","21:27:00","22:13:00","00:46:00","Denis GODEŠA",723,2,"L","Matjaž ERČULJ",80,7,"W","F",false]
[{"$f":"'Skupina 2'!C17","v":""},{"$f":"'Skupina 2'!B17","v":"Igor BAJSIČ"},null,null,null,null,{"$f":"CELL(\"address\",OFFSET($A$23,(G14-1)*2+2,0))","v":"$A$29"},null,{"$f":"Sheet1!Q22","v":"Franci ČUČNIK"},null,null,5,"L",true,10]
[{"$f":"'Skupina 3'!C16","v":""},{"$f":"'Skupina 3'!B16","v":"Aleksander RAIŠIČ"},null,null,null,null,"*",3,"16:00:00","18:06:00",{"$f":"IF(ISBLANK(I18),\"\",IF(ISBLANK(J18),CurrentTime-I18,J18-I18))","v":"02:06:00"},"F",{"$f":"IF(AND(COUNTIF(FinishedMatchStates,L18),NOT(ISNA(VLOOKUP(M16,MatchCompetitorStateCodes,1,FALSE))),NOT(ISNA(VLOOKUP(M17,MatchCompetitorStateCodes,1,FALSE))),COUNTIF(WinStates,M16)+COUNTIF(WinStates,M17)<=1,COUNTIF(LoseStates,M16)+COUNTIF(LoseStates,M17)<=1,IF(M16=NormalWinState,AND(M17=NormalLoseState,L16>L17),TRUE),IF(M17=NormalWinState,AND(M16=NormalLoseState,L17>L16),TRUE),NOT(ISBLANK(L15)),NOT(ISBLANK(I15)),NOT(ISBLANK(I18)),NOT(ISBLANK(J18)),H15>0),1,IF(COUNTIF(FinishedMatchStates,L18)>0,-1,0))","v":-1},null,{"$f":"CELL(\"address\",H16)","v":"$H$16"},{"$f":"IF(AND(NOT(ISBLANK(Q19)),Q19<>UnsetMatchCompetitorText,Q19<>AwaitingMatchCompetitorText,NOT(ISBLANK(Q20)),Q20<>UnsetMatchCompetitorText,Q20<>AwaitingMatchCompetitorText),1,IF(AND(Q19<>AwaitingMatchCompetitorText,Q20<>AwaitingMatchCompetitorText),-1,0))","v":1},null,null,null,7]
[{"$f":"'Skupina 3'!C17","v":""},{"$f":"'Skupina 3'!B17","v":"Miha ŽAGAR"},null,null,null,null,null,null,null,null,null,null,null,null,"WinStates",{"$f":"O17","v":10},{"$f":"I16","v":"Denis GODEŠA"},null,null,7,"W",true]
[{"$f":"'Skupina 4'!C16","v":""},{"$f":"'Skupina 4'!B16","v":"Nino PORIČ"},null,null,null,null,{"$f":"G14+1","v":4},null,null,null,null,null,null,null,{"$f":"CELL(\"address\",H22)","v":"$H$22"},null,{"$f":"I23","v":"Klemen GRADIŠNIK"},null,null,6,"L",true]
[{"$f":"'Skupina 4'!C17","v":""},{"$f":"'Skupina 4'!B17","v":"Franci ČUČNIK"},null,null,null,null,{"$f":"CELL(\"address\",OFFSET($A$23,(G20-1)*2+1,0))","v":"$A$30"},{"$f":"IF(AND(NOT(ISBLANK(I22)),I22<>UnsetMatchCompetitorText,I22<>AwaitingMatchCompetitorText,NOT(ISBLANK(I23)),I23<>UnsetMatchCompetitorText,I23<>AwaitingMatchCompetitorText),1,IF(AND(I22<>AwaitingMatchCompetitorText,I23<>AwaitingMatchCompetitorText),-1,0))","v":1},null,null,null,7,null,null,"WinStates",4,"18:06:00","19:55:00",{"$f":"IF(ISBLANK(Q21),\"\",IF(ISBLANK(R21),CurrentTime-Q21,R21-Q21))","v":"01:49:00"},"F",{"$f":"IF(AND(COUNTIF(FinishedMatchStates,T21),NOT(ISNA(VLOOKUP(U19,MatchCompetitorStateCodes,1,FALSE))),NOT(ISNA(VLOOKUP(U20,MatchCompetitorStateCodes,1,FALSE))),COUNTIF(WinStates,U19)+COUNTIF(WinStates,U20)<=1,COUNTIF(LoseStates,U19)+COUNTIF(LoseStates,U20)<=1,IF(U19=NormalWinState,AND(U20=NormalLoseState,T19>T20),TRUE),IF(U20=NormalWinState,AND(U19=NormalLoseState,T20>T19),TRUE),NOT(ISBLANK(T18)),NOT(ISBLANK(Q18)),NOT(ISBLANK(Q21)),NOT(ISBLANK(R21)),P18>0),1,IF(COUNTIF(FinishedMatchStates,T21)>0,-1,0))","v":-1}]
[null,null,null,null,null,null,"*",{"$f":"G20","v":4},{"$f":"Sheet1!Q23","v":"Igor BAJSIČ"},null,null,5,"L",true]
["Poz.","Tekmovalec",null,null,null,null,{"$f":"CELL(\"address\",OFFSET($A$23,(G20-1)*2+2,0))","v":"$A$31"},null,{"$f":"IF(G24=\"*\",IF(AND(OFFSET(INDIRECT(G23),0,0)>0,NOT(ISNA(OFFSET(INDIRECT(G23),0,1)))),OFFSET(INDIRECT(G23),0,1),UnsetMatchCompetitorText),IF(OFFSET(INDIRECT(G23),2,5)>0,IF(COUNTIF(INDIRECT(G24),(OFFSET(INDIRECT(G23),0,5)))>0,OFFSET(INDIRECT(G23),0,1),IF(COUNTIF(INDIRECT(G24),(OFFSET(INDIRECT(G23),1,5)))>0,OFFSET(INDIRECT(G23),1,1),BlankMatchCompetitorText)),AwaitingMatchCompetitorText))","v":"Klemen GRADIŠNIK"},null,null,7,"W",true,null,null,null,null,null,null,null,null,null,null,null,null,null,null,null,null,15]
[1,{"$f":"VLOOKUP(A24,DrawFinal16,2,FALSE)","v":"Mitja GRADIŠNIK"},null,null,null,null,"*",4,"16:00:00","17:28:00",{"$f":"IF(ISBLANK(I24),\"\",IF(ISBLANK(J24),CurrentTime-I24,J24-I24))","v":"01:28:00"},"F",{"$f":"IF(AND(COUNTIF(FinishedMatchStates,L24),NOT(ISNA(VLOOKUP(M22,MatchCompetitorStateCodes,1,FALSE))),NOT(ISNA(VLOOKUP(M23,MatchCompetitorStateCodes,1,FALSE))),COUNTIF(WinStates,M22)+COUNTIF(WinStates,M23)<=1,COUNTIF(LoseStates,M22)+COUNTIF(LoseStates,M23)<=1,IF(M22=NormalWinState,AND(M23=NormalLoseState,L22>L23),TRUE),IF(M23=NormalWinState,AND(M22=NormalLoseState,L23>L22),TRUE),NOT(ISBLANK(L21)),NOT(ISBLANK(I21)),NOT(ISBLANK(I24)),NOT(ISBLANK(J24)),H21>0),1,IF(COUNTIF(FinishedMatchStates,L24)>0,-1,0))","v":-1},null,null,null,null,null,null,null,null,null,null,null,null,null,null,null,null,null,{"$f":"CELL(\"address\",X13)","v":"$X$13"},{"$f":"IF(AND(NOT(ISBLANK(AG25)),AG25<>UnsetMatchCompetitorText,AG25<>AwaitingMatchCompetitorText,NOT(ISBLANK(AG26)),AG26<>UnsetMatchCompetitorText,AG26<>AwaitingMatchCompetitorText),1,IF(AND(AG25<>AwaitingMatchCompetitorText,AG26<>AwaitingMatchCompetitorText),-1,0))","v":1},null,null,null,7]
[2,{"$error":"#N/A"},null,null,null,null,null,null,null,null,null,null,null,null,null,null,null,null,null,null,null,null,null,null,null,null,null,null,null,null,"WinStates",{"$f":"AE23","v":15},{"$f":"Y14","v":"Denis GODEŠA"},null,null,2,"L",true]
[3,{"$error":"#N/A"},null,null,null,null,{"$f":"G20+1","v":5},null,null,null,null,null,null,null,null,null,null,null,null,null,null,null,null,null,null,null,null,null,null,null,{"$f":"CELL(\"address\",X37)","v":"$X$37"},null,{"$f":"Y37","v":"Matjaž ERČULJ"},null,null,7,"W",true]
[4,"Denis GODEŠA",null,null,null,null,{"$f":"CELL(\"address\",OFFSET($A$23,(G26-1)*2+1,0))","v":"$A$32"},{"$f":"IF(AND(NOT(ISBLANK(I28)),I28<>UnsetMatchCompetitorText,I28<>AwaitingMatchCompetitorText,NOT(ISBLANK(I29)),I29<>UnsetMatchCompetitorText,I29<>AwaitingMatchCompetitorText),1,IF(AND(I28<>AwaitingMatchCompetitorText,I29<>AwaitingMatchCompetitorText),-1,0))","v":1},null,null,null,7,null,null,null,null,null,null,null,null,null,null,null,null,null,null,null,null,null,null,"WinStates",6,"21:27:00","22:13:00",{"$f":"IF(ISBLANK(AG27),\"\",IF(ISBLANK(AH27),CurrentTime-AG27,AH27-AG27))","v":"00:46:00"},"F",{"$f":"IF(AND(COUNTIF(FinishedMatchStates,AJ27),NOT(ISNA(VLOOKUP(AK25,MatchCompetitorStateCodes,1,FALSE))),NOT(ISNA(VLOOKUP(AK26,MatchCompetitorStateCodes,1,FALSE))),COUNTIF(WinStates,AK25)+COUNTIF(WinStates,AK26)<=1,COUNTIF(LoseStates,AK25)+COUNTIF(LoseStates,AK26)<=1,IF(AK25=NormalWinState,AND(AK26=NormalLoseState,AJ25>AJ26),TRUE),IF(AK26=NormalWinState,AND(AK25=NormalLoseState,AJ26>AJ25),TRUE),NOT(ISBLANK(AJ24)),NOT(ISBLANK(AG24)),NOT(ISBLANK(AG27)),NOT(ISBLANK(AH27)),AF24>0),1,IF(COUNTIF(FinishedMatchStates,AJ27)>0,-1,0))","v":-1}]
[5,"Damjan KEREP",null,null,null,null,"*",{"$f":"G26","v":5},{"$f":"IF(G28=\"*\",IF(AND(OFFSET(INDIRECT(G27),0,0)>0,NOT(ISNA(OFFSET(INDIRECT(G27),0,1)))),OFFSET(INDIRECT(G27),0,1),UnsetMatchCompetitorText),IF(OFFSET(INDIRECT(G27),2,5)>0,IF(COUNTIF(INDIRECT(G28),(OFFSET(INDIRECT(G27),0,5)))>0,OFFSET(INDIRECT(G27),0,1),IF(COUNTIF(INDIRECT(G28),(OFFSET(INDIRECT(G27),1,5)))>0,OFFSET(INDIRECT(G27),1,1),BlankMatchCompetitorText)),AwaitingMatchCompetitorText))","v":"Matjaž ERČULJ"},null,null,7,"W",true]
[6,{"$error":"#N/A"},null,null,null,null,{"$f":"CELL(\"address\",OFFSET($A$23,(G26-1)*2+2,0))","v":"$A$33"},null,{"$f":"Sheet1!Q24","v":"Kristijan HAMZOVSKI"},null,null,3,"L",true,11]
[7,{"$error":"#N/A"},null,null,null,null,"*",5,"16:00:00","17:03:00",{"$f":"IF(ISBLANK(I30),\"\",IF(ISBLANK(J30),CurrentTime-I30,J30-I30))","v":"01:03:00"},"F",{"$f":"IF(AND(COUNTIF(FinishedMatchStates,L30),NOT(ISNA(VLOOKUP(M28,MatchCompetitorStateCodes,1,FALSE))),NOT(ISNA(VLOOKUP(M29,MatchCompetitorStateCodes,1,FALSE))),COUNTIF(WinStates,M28)+COUNTIF(WinStates,M29)<=1,COUNTIF(LoseStates,M28)+COUNTIF(LoseStates,M29)<=1,IF(M28=NormalWinState,AND(M29=NormalLoseState,L28>L29),TRUE),IF(M29=NormalWinState,AND(M28=NormalLoseState,L29>L28),TRUE),NOT(ISBLANK(L27)),NOT(ISBLANK(I27)),NOT(ISBLANK(I30)),NOT(ISBLANK(J30)),H27>0),1,IF(COUNTIF(FinishedMatchStates,L30)>0,-1,0))","v":-1},null,{"$f":"CELL(\"address\",H28)","v":"$H$28"},{"$f":"IF(AND(NOT(ISBLANK(Q31)),Q31<>UnsetMatchCompetitorText,Q31<>AwaitingMatchCompetitorText,NOT(ISBLANK(Q32)),Q32<>UnsetMatchCompetitorText,Q32<>AwaitingMatchCompetitorText),1,IF(AND(Q31<>AwaitingMatchCompetitorText,Q32<>AwaitingMatchCompetitorText),-1,0))","v":1},null,null,null,7]
[8,"Klemen GRADIŠNIK",null,null,null,null,null,null,null,null,null,null,null,null,"WinStates",{"$f":"O29","v":11},{"$f":"I28","v":"Matjaž ERČULJ"},null,null,7,"W",true]
[9,"Matjaž ERČULJ",null,null,null,null,{"$f":"G26+1","v":6},null,null,null,null,null,null,null,{"$f":"CELL(\"address\",H34)","v":"$H$34"},null,{"$f":"I35","v":"Miha ZAJC"},null,null,4,"L",true]
[10,{"$error":"#N/A"},null,null,null,null,{"$f":"CELL(\"address\",OFFSET($A$23,(G32-1)*2+1,0))","v":"$A$34"},{"$f":"IF(AND(NOT(ISBLANK(I34)),I34<>UnsetMatchCompetitorText,I34<>AwaitingMatchCompetitorText,NOT(ISBLANK(I35)),I35<>UnsetMatchCompetitorText,I35<>AwaitingMatchCompetitorText),1,IF(AND(I34<>AwaitingMatchCompetitorText,I35<>AwaitingMatchCompetitorText),-1,0))","v":1},null,null,null,7,null,null,"WinStates",6,"17:49:00","18:52:00",{"$f":"IF(ISBLANK(Q33),\"\",IF(ISBLANK(R33),CurrentTime-Q33,R33-Q33))","v":"01:03:00"},"F",{"$f":"IF(AND(COUNTIF(FinishedMatchStates,T33),NOT(ISNA(VLOOKUP(U31,MatchCompetitorStateCodes,1,FALSE))),NOT(ISNA(VLOOKUP(U32,MatchCompetitorStateCodes,1,FALSE))),COUNTIF(WinStates,U31)+COUNTIF(WinStates,U32)<=1,COUNTIF(LoseStates,U31)+COUNTIF(LoseStates,U32)<=1,IF(U31=NormalWinState,AND(U32=NormalLoseState,T31>T32),TRUE),IF(U32=NormalWinState,AND(U31=NormalLoseState,T32>T31),TRUE),NOT(ISBLANK(T30)),NOT(ISBLANK(Q30)),NOT(ISBLANK(Q33)),NOT(ISBLANK(R33)),P30>0),1,IF(COUNTIF(FinishedMatchStates,T33)>0,-1,0))","v":-1}]
[11,{"$error":"#N/A"},null,null,null,null,"*",{"$f":"G32","v":6},{"$f":"Sheet1!Q25","v":"Matej BRAJKOVIČ"},null,null,6,"L",true]
[12,"Ana GRADIŠNIK",null,null,null,null,{"$f":"CELL(\"address\",OFFSET($A$23,(G32-1)*2+2,0))","v":"$A$35"},null,{"$f":"Sheet1!Q26","v":"Miha ZAJC"},null,null,7,"W",true,null,null,null,null,null,null,null,null,14]
[13,"Miha ZAJC",null,null,null,null,"*",6,"16:00:00","17:48:00",{"$f":"IF(ISBLANK(I36),\"\",IF(ISBLANK(J36),CurrentTime-I36,J36-I36))","v":"01:48:00"},"F",{"$f":"IF(AND(COUNTIF(FinishedMatchStates,L36),NOT(ISNA(VLOOKUP(M34,MatchCompetitorStateCodes,1,FALSE))),NOT(ISNA(VLOOKUP(M35,MatchCompetitorStateCodes,1,FALSE))),COUNTIF(WinStates,M34)+COUNTIF(WinStates,M35)<=1,COUNTIF(LoseStates,M34)+COUNTIF(LoseStates,M35)<=1,IF(M34=NormalWinState,AND(M35=NormalLoseState,L34>L35),TRUE),IF(M35=NormalWinState,AND(M34=NormalLoseState,L35>L34),TRUE),NOT(ISBLANK(L33)),NOT(ISBLANK(I33)),NOT(ISBLANK(I36)),NOT(ISBLANK(J36)),H33>0),1,IF(COUNTIF(FinishedMatchStates,L36)>0,-1,0))","v":-1},null,null,null,null,null,null,null,null,null,{"$f":"CELL(\"address\",P31)","v":"$P$31"},{"$f":"IF(AND(NOT(ISBLANK(Y37)),Y37<>UnsetMatchCompetitorText,Y37<>AwaitingMatchCompetitorText,NOT(ISBLANK(Y38)),Y38<>UnsetMatchCompetitorText,Y38<>AwaitingMatchCompetitorText),1,IF(AND(Y37<>AwaitingMatchCompetitorText,Y38<>AwaitingMatchCompetitorText),-1,0))","v":1},null,null,null,7]
[14,{"$error":"#N/A"},null,null,null,null,null,null,null,null,null,null,null,null,null,null,null,null,null,null,null,null,"WinStates",{"$f":"W35","v":14},{"$f":"Q31","v":"Matjaž ERČULJ"},null,null,7,"W",true]
[15,{"$error":"#N/A"},null,null,null,null,{"$f":"G32+1","v":7},null,null,null,null,null,null,null,null,null,null,null,null,null,null,null,{"$f":"CELL(\"address\",P43)","v":"$P$43"},null,{"$f":"Q43","v":"Nino PORIČ"},null,null,4,"L",true]
[16,"Jurij POTOČNIK",null,null,null,null,{"$f":"CELL(\"address\",OFFSET($A$23,(G38-1)*2+1,0))","v":"$A$36"},{"$f":"IF(AND(NOT(ISBLANK(I40)),I40<>UnsetMatchCompetitorText,I40<>AwaitingMatchCompetitorText,NOT(ISBLANK(I41)),I41<>UnsetMatchCompetitorText,I41<>AwaitingMatchCompetitorText),1,IF(AND(I40<>AwaitingMatchCompetitorText,I41<>AwaitingMatchCompetitorText),-1,0))","v":1},null,null,null,7,null,null,null,null,null,null,null,null,null,null,"WinStates",6,"19:56:00","20:52:00",{"$f":"IF(ISBLANK(Y39),\"\",IF(ISBLANK(Z39),CurrentTime-Y39,Z39-Y39))","v":"00:56:00"},"F",{"$f":"IF(AND(COUNTIF(FinishedMatchStates,AB39),NOT(ISNA(VLOOKUP(AC37,MatchCompetitorStateCodes,1,FALSE))),NOT(ISNA(VLOOKUP(AC38,MatchCompetitorStateCodes,1,FALSE))),COUNTIF(WinStates,AC37)+COUNTIF(WinStates,AC38)<=1,COUNTIF(LoseStates,AC37)+COUNTIF(LoseStates,AC38)<=1,IF(AC37=NormalWinState,AND(AC38=NormalLoseState,AB37>AB38),TRUE),IF(AC38=NormalWinState,AND(AC37=NormalLoseState,AB38>AB37),TRUE),NOT(ISBLANK(AB36)),NOT(ISBLANK(Y36)),NOT(ISBLANK(Y39)),NOT(ISBLANK(Z39)),X36>0),1,IF(COUNTIF(FinishedMatchStates,AB39)>0,-1,0))","v":-1}]
[null,null,null,null,null,null,"*",{"$f":"G38","v":7},{"$f":"Sheet1!Q27","v":"Miha ŽAGAR"},null,null,2,"L",true]
["Uvr.","Tekmovalec","L","S",null,null,{"$f":"CELL(\"address\",OFFSET($A$23,(G38-1)*2+2,0))","v":"$A$37"},null,{"$f":"Sheet1!Q28","v":"Nino PORIČ"},null,null,7,"W",true,12]
[1,{"$f":"IF(OFFSET(INDIRECT(C42),2,5)>0,IF(COUNTIF(INDIRECT(D42),(OFFSET(INDIRECT(C42),0,5)))>0,OFFSET(INDIRECT(C42),0,1),IF(COUNTIF(INDIRECT(D42),(OFFSET(INDIRECT(C42),1,5)))>0,OFFSET(INDIRECT(C42),1,1),BlankMatchCompetitorText)),\"\")","v":""},{"$f":"CELL(\"address\",AF25)","v":"$AF$25"},"WinStates",null,null,"*",7,"16:00:00","16:56:00",{"$f":"IF(ISBLANK(I42),\"\",IF(ISBLANK(J42),CurrentTime-I42,J42-I42))","v":"00:56:00"},"F",{"$f":"IF(AND(COUNTIF(FinishedMatchStates,L42),NOT(ISNA(VLOOKUP(M40,MatchCompetitorStateCodes,1,FALSE))),NOT(ISNA(VLOOKUP(M41,MatchCompetitorStateCodes,1,FALSE))),COUNTIF(WinStates,M40)+COUNTIF(WinStates,M41)<=1,COUNTIF(LoseStates,M40)+COUNTIF(LoseStates,M41)<=1,IF(M40=NormalWinState,AND(M41=NormalLoseState,L40>L41),TRUE),IF(M41=NormalWinState,AND(M40=NormalLoseState,L41>L40),TRUE),NOT(ISBLANK(L39)),NOT(ISBLANK(I39)),NOT(ISBLANK(I42)),NOT(ISBLANK(J42)),H39>0),1,IF(COUNTIF(FinishedMatchStates,L42)>0,-1,0))","v":-1},null,{"$f":"CELL(\"address\",H40)","v":"$H$40"},{"$f":"IF(AND(NOT(ISBLANK(Q43)),Q43<>UnsetMatchCompetitorText,Q43<>AwaitingMatchCompetitorText,NOT(ISBLANK(Q44)),Q44<>UnsetMatchCompetitorText,Q44<>AwaitingMatchCompetitorText),1,IF(AND(Q43<>AwaitingMatchCompetitorText,Q44<>AwaitingMatchCompetitorText),-1,0))","v":1},null,null,null,7]
[2,"",{"$f":"CELL(\"address\",AF25)","v":"$AF$25"},"LoseStates",null,null,null,null,null,null,null,null,null,null,"WinStates",{"$f":"O41","v":12},{"$f":"I41","v":"Nino PORIČ"},null,null,7,"W",true]
[3,"",{"$f":"CELL(\"address\",X13)","v":"$X$13"},"LoseStates",null,null,{"$f":"G38+1","v":8},null,null,null,null,null,null,null,{"$f":"CELL(\"address\",H46)","v":"$H$46"},null,{"$f":"I47","v":"Jurij POTOČNIK"},null,null,2,"L",true]
[3,"",{"$f":"CELL(\"address\",X37)","v":"$X$37"},"LoseStates",null,null,{"$f":"CELL(\"address\",OFFSET($A$23,(G44-1)*2+1,0))","v":"$A$38"},{"$f":"IF(AND(NOT(ISBLANK(I46)),I46<>UnsetMatchCompetitorText,I46<>AwaitingMatchCompetitorText,NOT(ISBLANK(I47)),I47<>UnsetMatchCompetitorText,I47<>AwaitingMatchCompetitorText),1,IF(AND(I46<>AwaitingMatchCompetitorText,I47<>AwaitingMatchCompetitorText),-1,0))","v":1},null,null,null,7,null,null,"WinStates",null,"17:31:00","18:30:00",{"$f":"IF(ISBLANK(Q45),\"\",IF(ISBLANK(R45),CurrentTime-Q45,R45-Q45))","v":"00:59:00"},"F",{"$f":"IF(AND(COUNTIF(FinishedMatchStates,T45),NOT(ISNA(VLOOKUP(U43,MatchCompetitorStateCodes,1,FALSE))),NOT(ISNA(VLOOKUP(U44,MatchCompetitorStateCodes,1,FALSE))),COUNTIF(WinStates,U43)+COUNTIF(WinStates,U44)<=1,COUNTIF(LoseStates,U43)+COUNTIF(LoseStates,U44)<=1,IF(U43=NormalWinState,AND(U44=NormalLoseState,T43>T44),TRUE),IF(U44=NormalWinState,AND(U43=NormalLoseState,T44>T43),TRUE),NOT(ISBLANK(T42)),NOT(ISBLANK(Q42)),NOT(ISBLANK(Q45)),NOT(ISBLANK(R45)),P42>0),1,IF(COUNTIF(FinishedMatchStates,T45)>0,-1,0))","v":-1}]
[5,"",{"$f":"CELL(\"address\",P7)","v":"$P$7"},"LoseStates",null,null,"*",{"$f":"G44","v":8},{"$f":"Sheet1!Q29","v":"Robert REDNAK"},null,null,3,"L",true]
[5,"",{"$f":"CELL(\"address\",P19)","v":"$P$19"},"LoseStates",null,null,{"$f":"CELL(\"address\",OFFSET($A$23,(G44-1)*2+2,0))","v":"$A$39"},null,{"$f":"IF(G48=\"*\",IF(AND(OFFSET(INDIRECT(G47),0,0)>0,NOT(ISNA(OFFSET(INDIRECT(G47),0,1)))),OFFSET(INDIRECT(G47),0,1),UnsetMatchCompetitorText),IF(OFFSET(INDIRECT(G47),2,5)>0,IF(COUNTIF(INDIRECT(G48),(OFFSET(INDIRECT(G47),0,5)))>0,OFFSET(INDIRECT(G47),0,1),IF(COUNTIF(INDIRECT(G48),(OFFSET(INDIRECT(G47),1,5)))>0,OFFSET(INDIRECT(G47),1,1),BlankMatchCompetitorText)),AwaitingMatchCompetitorText))","v":"Jurij POTOČNIK"},null,null,7,"W",true]
[5,"",{"$f":"CELL(\"address\",P31)","v":"$P$31"},"LoseStates",null,null,"*",null,"16:00:00","17:30:00",{"$f":"IF(ISBLANK(I48),\"\",IF(ISBLANK(J48),CurrentTime-I48,J48-I48))","v":"01:30:00"},"F",{"$f":"IF(AND(COUNTIF(FinishedMatchStates,L48),NOT(ISNA(VLOOKUP(M46,MatchCompetitorStateCodes,1,FALSE))),NOT(ISNA(VLOOKUP(M47,MatchCompetitorStateCodes,1,FALSE))),COUNTIF(WinStates,M46)+COUNTIF(WinStates,M47)<=1,COUNTIF(LoseStates,M46)+COUNTIF(LoseStates,M47)<=1,IF(M46=NormalWinState,AND(M47=NormalLoseState,L46>L47),TRUE),IF(M47=NormalWinState,AND(M46=NormalLoseState,L47>L46),TRUE),NOT(ISBLANK(L45)),NOT(ISBLANK(I45)),NOT(ISBLANK(I48)),NOT(ISBLANK(J48)),H45>0),1,IF(COUNTIF(FinishedMatchStates,L48)>0,-1,0))","v":-1}]
[5,"",{"$f":"CELL(\"address\",P43)","v":"$P$43"},"LoseStates"]
[9,"",{"$f":"CELL(\"address\",H4)","v":"$H$4"},"LoseStates"]
[9,"",{"$f":"CELL(\"address\",H10)","v":"$H$10"},"LoseStates"]
[9,"",{"$f":"CELL(\"address\",H16)","v":"$H$16"},"LoseStates"]
[9,"",{"$f":"CELL(\"address\",H22)","v":"$H$22"},"LoseStates"]
[9,"",{"$f":"CELL(\"address\",H28)","v":"$H$28"},"LoseStates"]
[9,"",{"$f":"CELL(\"address\",H34)","v":"$H$34"},"LoseStates"]
[9,"",{"$f":"CELL(\"address\",H40)","v":"$H$40"},"LoseStates"]
[9,"",{"$f":"CELL(\"address\",H46)","v":"$H$46"},"LoseStates"]

{"sheet":"Rezultati","index":8,"n_rows":129,"n_cols":5,"rows_kept":129,"cut":false,"hidden":false,"merged":[]}
["Uvrstitev","Tekmovalec","Evid. št.","Društvo","Rezultat"]
[{"$f":"'Finalna skupina'!A42","v":1},{"$f":"'Finalna skupina'!B42","v":""},{"$f":"IF(AND(B2<>BlankMatchCompetitorText,B2<>\"\"),CONCATENATE(VLOOKUP(B2,AnnouncementListCompetitors,6,FALSE)),\"\")","v":""},{"$f":"IF(AND(B2<>BlankMatchCompetitorText,B2<>\"\"),CONCATENATE(VLOOKUP(B2,AnnouncementListCompetitors,7,FALSE)),\"\")","v":""}]
[{"$f":"'Finalna skupina'!A43","v":2},{"$f":"'Finalna skupina'!B43","v":""},"",""]
[{"$f":"'Finalna skupina'!A44","v":3},{"$f":"'Finalna skupina'!B44","v":""},"",""]
[{"$f":"'Finalna skupina'!A45","v":3},{"$f":"'Finalna skupina'!B45","v":""},"",""]
[{"$f":"'Finalna skupina'!A46","v":5},{"$f":"'Finalna skupina'!B46","v":""},"",""]
[{"$f":"'Finalna skupina'!A47","v":5},{"$f":"'Finalna skupina'!B47","v":""},"",""]
[{"$f":"'Finalna skupina'!A48","v":5},{"$f":"'Finalna skupina'!B48","v":""},"",""]
[{"$f":"'Finalna skupina'!A49","v":5},{"$f":"'Finalna skupina'!B49","v":""},"",""]
[{"$f":"'Finalna skupina'!A50","v":9},{"$f":"'Finalna skupina'!B50","v":""},"",""]
[{"$f":"'Finalna skupina'!A51","v":9},{"$f":"'Finalna skupina'!B51","v":""},"",""]
[{"$f":"'Finalna skupina'!A52","v":9},{"$f":"'Finalna skupina'!B52","v":""},"",""]
[{"$f":"'Finalna skupina'!A53","v":9},{"$f":"'Finalna skupina'!B53","v":""},"",""]
[{"$f":"'Finalna skupina'!A54","v":9},{"$f":"'Finalna skupina'!B54","v":""},"",""]
[{"$f":"'Finalna skupina'!A55","v":9},{"$f":"'Finalna skupina'!B55","v":""},"",""]
[{"$f":"'Finalna skupina'!A56","v":9},{"$f":"'Finalna skupina'!B56","v":""},"",""]
[{"$f":"'Finalna skupina'!A57","v":9},{"$f":"'Finalna skupina'!B57","v":""},"",""]
[{"$f":"'Skupina 1'!A18","v":17},{"$f":"_xlfn.IFNA('Skupina 1'!B18,\"\")","v":""},"",""]
[{"$f":"'Skupina 2'!A18","v":17},{"$f":"_xlfn.IFNA('Skupina 2'!B18,\"\")","v":""},"",""]
[{"$f":"'Skupina 3'!A18","v":17},{"$f":"_xlfn.IFNA('Skupina 3'!B18,\"\")","v":""},"",""]
[{"$f":"'Skupina 4'!A18","v":17},{"$f":"_xlfn.IFNA('Skupina 4'!B18,\"\")","v":""},"",""]
[{"$f":"'Skupina 1'!A19","v":21},{"$f":"_xlfn.IFNA('Skupina 1'!B19,\"\")","v":""},"",""]
[{"$f":"'Skupina 2'!A19","v":21},{"$f":"_xlfn.IFNA('Skupina 2'!B19,\"\")","v":""},"",""]
[{"$f":"'Skupina 3'!A19","v":21},{"$f":"_xlfn.IFNA('Skupina 3'!B19,\"\")","v":""},"",""]
[{"$f":"'Skupina 4'!A19","v":21},{"$f":"_xlfn.IFNA('Skupina 4'!B19,\"\")","v":""},"",""]
[{"$f":"'Skupina 1'!A20","v":25},{"$f":"_xlfn.IFNA('Skupina 1'!B20,\"\")","v":""},"",""]
[{"$f":"'Skupina 2'!A20","v":25},{"$f":"_xlfn.IFNA('Skupina 2'!B20,\"\")","v":""},"",""]
[{"$f":"'Skupina 3'!A20","v":25},{"$f":"_xlfn.IFNA('Skupina 3'!B20,\"\")","v":""},"",""]
[{"$f":"'Skupina 4'!A20","v":25},{"$f":"_xlfn.IFNA('Skupina 4'!B20,\"\")","v":""},"",""]
[{"$f":"'Skupina 1'!A21","v":29},{"$f":"_xlfn.IFNA('Skupina 1'!B21,\"\")","v":""},"",""]
[{"$f":"'Skupina 2'!A21","v":29},{"$f":"_xlfn.IFNA('Skupina 2'!B21,\"\")","v":""},"",""]
[{"$f":"'Skupina 3'!A21","v":29},{"$f":"_xlfn.IFNA('Skupina 3'!B21,\"\")","v":""},"",""]
[{"$f":"'Skupina 4'!A21","v":29},{"$f":"_xlfn.IFNA('Skupina 4'!B21,\"\")","v":""},"",""]
[{"$f":"'Skupina 1'!A22","v":33},{"$f":"_xlfn.IFNA('Skupina 1'!B22,\"\")","v":""},{"$f":"IF(AND(B34<>BlankMatchCompetitorText,B34<>\"\"),CONCATENATE(VLOOKUP(B34,AnnouncementListCompetitors,6,FALSE)),\"\")","v":""},{"$f":"IF(AND(B34<>BlankMatchCompetitorText,B34<>\"\"),CONCATENATE(VLOOKUP(B34,AnnouncementListCompetitors,7,FALSE)),\"\")","v":""}]
[{"$f":"'Skupina 2'!A22","v":33},{"$f":"_xlfn.IFNA('Skupina 2'!B22,\"\")","v":""},"",""]
[{"$f":"'Skupina 3'!A22","v":33},{"$f":"_xlfn.IFNA('Skupina 3'!B22,\"\")","v":""},"",""]
[{"$f":"'Skupina 4'!A22","v":33},{"$f":"_xlfn.IFNA('Skupina 4'!B22,\"\")","v":""},"",""]
[{"$f":"'Skupina 1'!A23","v":37},{"$f":"_xlfn.IFNA('Skupina 1'!B23,\"\")","v":""},"",""]
[{"$f":"'Skupina 2'!A23","v":37},{"$f":"_xlfn.IFNA('Skupina 2'!B23,\"\")","v":""},"",""]
[{"$f":"'Skupina 3'!A23","v":37},{"$f":"_xlfn.IFNA('Skupina 3'!B23,\"\")","v":""},"",""]
[{"$f":"'Skupina 4'!A23","v":37},{"$f":"_xlfn.IFNA('Skupina 4'!B23,\"\")","v":""},"",""]
[null,null,"",""]
[null,null,"",""]
[null,null,"",""]
[null,null,"",""]
[null,null,"",""]
[null,null,"",""]
[null,null,"",""]
[null,null,"",""]
[null,null,"",""]
[null,null,"",""]
[null,null,"",""]
[null,null,"",""]
[null,null,"",""]
[null,null,"",""]
[null,null,"",""]
[null,null,"",""]
[null,null,"",""]
[null,null,"",""]
[null,null,"",""]
[null,null,"",""]
[null,null,"",""]
[null,null,"",""]
[null,null,"",""]
[null,null,"",""]
[null,null,{"$f":"IF(AND(B66<>BlankMatchCompetitorText,B66<>\"\"),CONCATENATE(VLOOKUP(B66,AnnouncementListCompetitors,6,FALSE)),\"\")","v":""},{"$f":"IF(AND(B66<>BlankMatchCompetitorText,B66<>\"\"),CONCATENATE(VLOOKUP(B66,AnnouncementListCompetitors,7,FALSE)),\"\")","v":""}]
[null,null,"",""]
[null,null,"",""]
[null,null,"",""]
[null,null,"",""]
[null,null,"",""]
[null,null,"",""]
[null,null,"",""]
[null,null,"",""]
[null,null,"",""]
[null,null,"",""]
[null,null,"",""]
[null,null,"",""]
[null,null,"",""]
[null,null,"",""]
[null,null,"",""]
[null,null,"",""]
[null,null,"",""]
[null,null,"",""]
[null,null,"",""]
[null,null,"",""]
[null,null,"",""]
[null,null,"",""]
[null,null,"",""]
[null,null,"",""]
[null,null,"",""]
[null,null,"",""]
[null,null,"",""]
[null,null,"",""]
[null,null,"",""]
[null,null,"",""]
[null,null,"",""]
[null,null,{"$f":"IF(AND(B98<>BlankMatchCompetitorText,B98<>\"\"),CONCATENATE(VLOOKUP(B98,AnnouncementListCompetitors,6,FALSE)),\"\")","v":""},{"$f":"IF(AND(B98<>BlankMatchCompetitorText,B98<>\"\"),CONCATENATE(VLOOKUP(B98,AnnouncementListCompetitors,7,FALSE)),\"\")","v":""}]
[null,null,"",""]
[null,null,"",""]
[null,null,"",""]
[null,null,"",""]
[null,null,"",""]
[null,null,"",""]
[null,null,"",""]
[null,null,"",""]
[null,null,"",""]
[null,null,"",""]
[null,null,"",""]
[null,null,"",""]
[null,null,"",""]
[null,null,"",""]
[null,null,"",""]
[null,null,"",""]
[null,null,"",""]
[null,null,"",""]
[null,null,"",""]
[null,null,"",""]
[null,null,"",""]
[null,null,"",""]
[null,null,"",""]
[null,null,"",""]
[null,null,"",""]
[null,null,"",""]
[null,null,"",""]
[null,null,"",""]
[null,null,"",""]
[null,null,"",""]
[null,null,"",""]

{"sheet":"Dvoboji","index":9,"n_rows":128,"n_cols":19,"rows_kept":128,"cut":false,"hidden":true,"merged":[]}
["Group","Match nr.","Table","Scheduled time","Target","Notes","Start time","End time","Duration","P1 Name","P1 Code","P1 Score","P1 State","P2 Name","P2 Code","P2 Score","P2 State","Match State","Is Valid"]
[{"$f":"'Skupina 1'!CE2","v":"1"},{"$f":"'Skupina 1'!CF2","v":1},{"$f":"'Skupina 1'!CG2","v":""},{"$f":"'Skupina 1'!CH2","v":"09:00:00"},{"$f":"'Skupina 1'!CI2","v":0},{"$f":"'Skupina 1'!CJ2","v":""},{"$f":"'Skupina 1'!CK2","v":"00:00:00"},{"$f":"'Skupina 1'!CL2","v":"00:00:00"},{"$f":"'Skupina 1'!CM2","v":""},{"$f":"'Skupina 1'!CN2","v":""},{"$f":"'Skupina 1'!CO2","v":0},{"$f":"'Skupina 1'!CP2","v":0},{"$f":"'Skupina 1'!CQ2","v":0},{"$f":"'Skupina 1'!CR2","v":""},{"$f":"'Skupina 1'!CS2","v":0},{"$f":"'Skupina 1'!CT2","v":0},{"$f":"'Skupina 1'!CU2","v":0},{"$f":"'Skupina 1'!CV2","v":0},{"$f":"'Skupina 1'!CW2","v":false}]
[{"$f":"'Skupina 1'!CE3","v":"1"},{"$f":"'Skupina 1'!CF3","v":2},{"$f":"'Skupina 1'!CG3","v":""},{"$f":"'Skupina 1'!CH3","v":"09:00:00"},{"$f":"'Skupina 1'!CI3","v":0},{"$f":"'Skupina 1'!CJ3","v":""},{"$f":"'Skupina 1'!CK3","v":"00:00:00"},{"$f":"'Skupina 1'!CL3","v":"00:00:00"},{"$f":"'Skupina 1'!CM3","v":""},{"$f":"'Skupina 1'!CN3","v":"Robert REDNAK"},{"$f":"'Skupina 1'!CO3","v":178},{"$f":"'Skupina 1'!CP3","v":0},{"$f":"'Skupina 1'!CQ3","v":0},{"$f":"'Skupina 1'!CR3","v":""},{"$f":"'Skupina 1'!CS3","v":0},{"$f":"'Skupina 1'!CT3","v":0},{"$f":"'Skupina 1'!CU3","v":0},{"$f":"'Skupina 1'!CV3","v":0},{"$f":"'Skupina 1'!CW3","v":false}]
[{"$f":"'Skupina 1'!CE4","v":"1"},{"$f":"'Skupina 1'!CF4","v":3},{"$f":"'Skupina 1'!CG4","v":"2"},{"$f":"'Skupina 1'!CH4","v":"09:00:00"},{"$f":"'Skupina 1'!CI4","v":5},{"$f":"'Skupina 1'!CJ4","v":""},{"$f":"'Skupina 1'!CK4","v":"10:08:00"},{"$f":"'Skupina 1'!CL4","v":"10:38:00"},{"$f":"'Skupina 1'!CM4","v":"00:30:00"},{"$f":"'Skupina 1'!CN4","v":"Blaž KOLENC"},{"$f":"'Skupina 1'!CO4","v":683},{"$f":"'Skupina 1'!CP4","v":0},{"$f":"'Skupina 1'!CQ4","v":"L"},{"$f":"'Skupina 1'!CR4","v":"Kristijan HAMZOVSKI"},{"$f":"'Skupina 1'!CS4","v":774},{"$f":"'Skupina 1'!CT4","v":5},{"$f":"'Skupina 1'!CU4","v":"W"},{"$f":"'Skupina 1'!CV4","v":"F"},{"$f":"'Skupina 1'!CW4","v":true}]
[{"$f":"'Skupina 1'!CE5","v":"1"},{"$f":"'Skupina 1'!CF5","v":4},{"$f":"'Skupina 1'!CG5","v":"1"},{"$f":"'Skupina 1'!CH5","v":"09:00:00"},{"$f":"'Skupina 1'!CI5","v":5},{"$f":"'Skupina 1'!CJ5","v":""},{"$f":"'Skupina 1'!CK5","v":"09:10:00"},{"$f":"'Skupina 1'!CL5","v":"10:18:00"},{"$f":"'Skupina 1'!CM5","v":"01:08:00"},{"$f":"'Skupina 1'!CN5","v":"Levin TKALČIČ"},{"$f":"'Skupina 1'!CO5","v":720},{"$f":"'Skupina 1'!CP5","v":3},{"$f":"'Skupina 1'!CQ5","v":"L"},{"$f":"'Skupina 1'!CR5","v":"Maks GERČAR"},{"$f":"'Skupina 1'!CS5","v":888},{"$f":"'Skupina 1'!CT5","v":5},{"$f":"'Skupina 1'!CU5","v":"W"},{"$f":"'Skupina 1'!CV5","v":"F"},{"$f":"'Skupina 1'!CW5","v":true}]
[{"$f":"'Skupina 1'!CE6","v":"1"},{"$f":"'Skupina 1'!CF6","v":5},{"$f":"'Skupina 1'!CG6","v":""},{"$f":"'Skupina 1'!CH6","v":"09:00:00"},{"$f":"'Skupina 1'!CI6","v":0},{"$f":"'Skupina 1'!CJ6","v":""},{"$f":"'Skupina 1'!CK6","v":"00:00:00"},{"$f":"'Skupina 1'!CL6","v":"00:00:00"},{"$f":"'Skupina 1'!CM6","v":""},{"$f":"'Skupina 1'!CN6","v":"Levin TKALČIČ"},{"$f":"'Skupina 1'!CO6","v":720},{"$f":"'Skupina 1'!CP6","v":0},{"$f":"'Skupina 1'!CQ6","v":0},{"$f":"'Skupina 1'!CR6","v":""},{"$f":"'Skupina 1'!CS6","v":0},{"$f":"'Skupina 1'!CT6","v":0},{"$f":"'Skupina 1'!CU6","v":0},{"$f":"'Skupina 1'!CV6","v":0},{"$f":"'Skupina 1'!CW6","v":false}]
[{"$f":"'Skupina 1'!CE7","v":"1"},{"$f":"'Skupina 1'!CF7","v":6},{"$f":"'Skupina 1'!CG7","v":""},{"$f":"'Skupina 1'!CH7","v":"09:00:00"},{"$f":"'Skupina 1'!CI7","v":0},{"$f":"'Skupina 1'!CJ7","v":""},{"$f":"'Skupina 1'!CK7","v":"00:00:00"},{"$f":"'Skupina 1'!CL7","v":"00:00:00"},{"$f":"'Skupina 1'!CM7","v":""},{"$f":"'Skupina 1'!CN7","v":""},{"$f":"'Skupina 1'!CO7","v":0},{"$f":"'Skupina 1'!CP7","v":0},{"$f":"'Skupina 1'!CQ7","v":0},{"$f":"'Skupina 1'!CR7","v":"Robert REDNAK"},{"$f":"'Skupina 1'!CS7","v":178},{"$f":"'Skupina 1'!CT7","v":0},{"$f":"'Skupina 1'!CU7","v":0},{"$f":"'Skupina 1'!CV7","v":0},{"$f":"'Skupina 1'!CW7","v":false}]
[{"$f":"'Skupina 1'!CE8","v":"1"},{"$f":"'Skupina 1'!CF8","v":7},{"$f":"'Skupina 1'!CG8","v":""},{"$f":"'Skupina 1'!CH8","v":"09:00:00"},{"$f":"'Skupina 1'!CI8","v":0},{"$f":"'Skupina 1'!CJ8","v":""},{"$f":"'Skupina 1'!CK8","v":"00:00:00"},{"$f":"'Skupina 1'!CL8","v":"00:00:00"},{"$f":"'Skupina 1'!CM8","v":""},{"$f":"'Skupina 1'!CN8","v":""},{"$f":"'Skupina 1'!CO8","v":0},{"$f":"'Skupina 1'!CP8","v":0},{"$f":"'Skupina 1'!CQ8","v":0},{"$f":"'Skupina 1'!CR8","v":"Blaž KOLENC"},{"$f":"'Skupina 1'!CS8","v":683},{"$f":"'Skupina 1'!CT8","v":0},{"$f":"'Skupina 1'!CU8","v":0},{"$f":"'Skupina 1'!CV8","v":0},{"$f":"'Skupina 1'!CW8","v":false}]
[{"$f":"'Skupina 1'!CE9","v":"1"},{"$f":"'Skupina 1'!CF9","v":8},{"$f":"'Skupina 1'!CG9","v":"2"},{"$f":"'Skupina 1'!CH9","v":"09:00:00"},{"$f":"'Skupina 1'!CI9","v":5},{"$f":"'Skupina 1'!CJ9","v":""},{"$f":"'Skupina 1'!CK9","v":"10:40:00"},{"$f":"'Skupina 1'!CL9","v":"11:10:00"},{"$f":"'Skupina 1'!CM9","v":"00:30:00"},{"$f":"'Skupina 1'!CN9","v":"Maks GERČAR"},{"$f":"'Skupina 1'!CO9","v":888},{"$f":"'Skupina 1'!CP9","v":0},{"$f":"'Skupina 1'!CQ9","v":"L"},{"$f":"'Skupina 1'!CR9","v":"Kristijan HAMZOVSKI"},{"$f":"'Skupina 1'!CS9","v":774},{"$f":"'Skupina 1'!CT9","v":5},{"$f":"'Skupina 1'!CU9","v":"W"},{"$f":"'Skupina 1'!CV9","v":"F"},{"$f":"'Skupina 1'!CW9","v":true}]
[{"$f":"'Skupina 1'!CE10","v":"1"},{"$f":"'Skupina 1'!CF10","v":9},{"$f":"'Skupina 1'!CG10","v":"1"},{"$f":"'Skupina 1'!CH10","v":"09:00:00"},{"$f":"'Skupina 1'!CI10","v":5},{"$f":"'Skupina 1'!CJ10","v":""},{"$f":"'Skupina 1'!CK10","v":"10:19:00"},{"$f":"'Skupina 1'!CL10","v":"11:35:00"},{"$f":"'Skupina 1'!CM10","v":"01:16:00"},{"$f":"'Skupina 1'!CN10","v":"Robert REDNAK"},{"$f":"'Skupina 1'!CO10","v":178},{"$f":"'Skupina 1'!CP10","v":5},{"$f":"'Skupina 1'!CQ10","v":"W"},{"$f":"'Skupina 1'!CR10","v":"Levin TKALČIČ"},{"$f":"'Skupina 1'!CS10","v":720},{"$f":"'Skupina 1'!CT10","v":3},{"$f":"'Skupina 1'!CU10","v":"L"},{"$f":"'Skupina 1'!CV10","v":"F"},{"$f":"'Skupina 1'!CW10","v":true}]
[{"$f":"'Skupina 1'!CE11","v":"1"},{"$f":"'Skupina 1'!CF11","v":10},{"$f":"'Skupina 1'!CG11","v":""},{"$f":"'Skupina 1'!CH11","v":"09:00:00"},{"$f":"'Skupina 1'!CI11","v":0},{"$f":"'Skupina 1'!CJ11","v":""},{"$f":"'Skupina 1'!CK11","v":"00:00:00"},{"$f":"'Skupina 1'!CL11","v":"00:00:00"},{"$f":"'Skupina 1'!CM11","v":""},{"$f":"'Skupina 1'!CN11","v":"Blaž KOLENC"},{"$f":"'Skupina 1'!CO11","v":683},{"$f":"'Skupina 1'!CP11","v":0},{"$f":"'Skupina 1'!CQ11","v":0},{"$f":"'Skupina 1'!CR11","v":""},{"$f":"'Skupina 1'!CS11","v":0},{"$f":"'Skupina 1'!CT11","v":0},{"$f":"'Skupina 1'!CU11","v":0},{"$f":"'Skupina 1'!CV11","v":0},{"$f":"'Skupina 1'!CW11","v":false}]
[{"$f":"'Skupina 1'!CE12","v":"1"},{"$f":"'Skupina 1'!CF12","v":11},{"$f":"'Skupina 1'!CG12","v":""},{"$f":"'Skupina 1'!CH12","v":"09:00:00"},{"$f":"'Skupina 1'!CI12","v":0},{"$f":"'Skupina 1'!CJ12","v":""},{"$f":"'Skupina 1'!CK12","v":"00:00:00"},{"$f":"'Skupina 1'!CL12","v":"00:00:00"},{"$f":"'Skupina 1'!CM12","v":""},{"$f":"'Skupina 1'!CN12","v":"Kristijan HAMZOVSKI"},{"$f":"'Skupina 1'!CO12","v":774},{"$f":"'Skupina 1'!CP12","v":0},{"$f":"'Skupina 1'!CQ12","v":0},{"$f":"'Skupina 1'!CR12","v":""},{"$f":"'Skupina 1'!CS12","v":0},{"$f":"'Skupina 1'!CT12","v":0},{"$f":"'Skupina 1'!CU12","v":0},{"$f":"'Skupina 1'!CV12","v":0},{"$f":"'Skupina 1'!CW12","v":false}]
[{"$f":"'Skupina 1'!CE13","v":"1"},{"$f":"'Skupina 1'!CF13","v":12},{"$f":"'Skupina 1'!CG13","v":""},{"$f":"'Skupina 1'!CH13","v":"09:00:00"},{"$f":"'Skupina 1'!CI13","v":0},{"$f":"'Skupina 1'!CJ13","v":""},{"$f":"'Skupina 1'!CK13","v":"00:00:00"},{"$f":"'Skupina 1'!CL13","v":"00:00:00"},{"$f":"'Skupina 1'!CM13","v":""},{"$f":"'Skupina 1'!CN13","v":""},{"$f":"'Skupina 1'!CO13","v":0},{"$f":"'Skupina 1'!CP13","v":0},{"$f":"'Skupina 1'!CQ13","v":0},{"$f":"'Skupina 1'!CR13","v":"Maks GERČAR"},{"$f":"'Skupina 1'!CS13","v":888},{"$f":"'Skupina 1'!CT13","v":0},{"$f":"'Skupina 1'!CU13","v":0},{"$f":"'Skupina 1'!CV13","v":0},{"$f":"'Skupina 1'!CW13","v":false}]
[{"$f":"'Skupina 1'!CE14","v":"1"},{"$f":"'Skupina 1'!CF14","v":13},{"$f":"'Skupina 1'!CG14","v":"1"},{"$f":"'Skupina 1'!CH14","v":"09:00:00"},{"$f":"'Skupina 1'!CI14","v":5},{"$f":"'Skupina 1'!CJ14","v":""},{"$f":"'Skupina 1'!CK14","v":"11:11:00"},{"$f":"'Skupina 1'!CL14","v":"12:43:00"},{"$f":"'Skupina 1'!CM14","v":"01:32:00"},{"$f":"'Skupina 1'!CN14","v":"Levin TKALČIČ"},{"$f":"'Skupina 1'!CO14","v":720},{"$f":"'Skupina 1'!CP14","v":3},{"$f":"'Skupina 1'!CQ14","v":"L"},{"$f":"'Skupina 1'!CR14","v":"Blaž KOLENC"},{"$f":"'Skupina 1'!CS14","v":683},{"$f":"'Skupina 1'!CT14","v":5},{"$f":"'Skupina 1'!CU14","v":"W"},{"$f":"'Skupina 1'!CV14","v":"F"},{"$f":"'Skupina 1'!CW14","v":true}]
[{"$f":"'Skupina 1'!CE15","v":"1"},{"$f":"'Skupina 1'!CF15","v":14},{"$f":"'Skupina 1'!CG15","v":""},{"$f":"'Skupina 1'!CH15","v":"09:00:00"},{"$f":"'Skupina 1'!CI15","v":0},{"$f":"'Skupina 1'!CJ15","v":""},{"$f":"'Skupina 1'!CK15","v":"00:00:00"},{"$f":"'Skupina 1'!CL15","v":"00:00:00"},{"$f":"'Skupina 1'!CM15","v":""},{"$f":"'Skupina 1'!CN15","v":""},{"$f":"'Skupina 1'!CO15","v":0},{"$f":"'Skupina 1'!CP15","v":0},{"$f":"'Skupina 1'!CQ15","v":0},{"$f":"'Skupina 1'!CR15","v":"Robert REDNAK"},{"$f":"'Skupina 1'!CS15","v":178},{"$f":"'Skupina 1'!CT15","v":0},{"$f":"'Skupina 1'!CU15","v":0},{"$f":"'Skupina 1'!CV15","v":0},{"$f":"'Skupina 1'!CW15","v":false}]
[{"$f":"'Skupina 1'!CE16","v":"1"},{"$f":"'Skupina 1'!CF16","v":15},{"$f":"'Skupina 1'!CG16","v":""},{"$f":"'Skupina 1'!CH16","v":"09:00:00"},{"$f":"'Skupina 1'!CI16","v":0},{"$f":"'Skupina 1'!CJ16","v":""},{"$f":"'Skupina 1'!CK16","v":"00:00:00"},{"$f":"'Skupina 1'!CL16","v":"00:00:00"},{"$f":"'Skupina 1'!CM16","v":""},{"$f":"'Skupina 1'!CN16","v":""},{"$f":"'Skupina 1'!CO16","v":0},{"$f":"'Skupina 1'!CP16","v":0},{"$f":"'Skupina 1'!CQ16","v":0},{"$f":"'Skupina 1'!CR16","v":"Kristijan HAMZOVSKI"},{"$f":"'Skupina 1'!CS16","v":774},{"$f":"'Skupina 1'!CT16","v":0},{"$f":"'Skupina 1'!CU16","v":0},{"$f":"'Skupina 1'!CV16","v":0},{"$f":"'Skupina 1'!CW16","v":false}]
[{"$f":"'Skupina 1'!CE17","v":"1"},{"$f":"'Skupina 1'!CF17","v":16},{"$f":"'Skupina 1'!CG17","v":""},{"$f":"'Skupina 1'!CH17","v":"09:00:00"},{"$f":"'Skupina 1'!CI17","v":0},{"$f":"'Skupina 1'!CJ17","v":""},{"$f":"'Skupina 1'!CK17","v":"00:00:00"},{"$f":"'Skupina 1'!CL17","v":"00:00:00"},{"$f":"'Skupina 1'!CM17","v":""},{"$f":"'Skupina 1'!CN17","v":"Maks GERČAR"},{"$f":"'Skupina 1'!CO17","v":888},{"$f":"'Skupina 1'!CP17","v":0},{"$f":"'Skupina 1'!CQ17","v":0},{"$f":"'Skupina 1'!CR17","v":""},{"$f":"'Skupina 1'!CS17","v":0},{"$f":"'Skupina 1'!CT17","v":0},{"$f":"'Skupina 1'!CU17","v":0},{"$f":"'Skupina 1'!CV17","v":0},{"$f":"'Skupina 1'!CW17","v":false}]
[{"$f":"'Skupina 1'!CE18","v":"1"},{"$f":"'Skupina 1'!CF18","v":17},{"$f":"'Skupina 1'!CG18","v":"1"},{"$f":"'Skupina 1'!CH18","v":"09:00:00"},{"$f":"'Skupina 1'!CI18","v":5},{"$f":"'Skupina 1'!CJ18","v":""},{"$f":"'Skupina 1'!CK18","v":"12:43:00"},{"$f":"'Skupina 1'!CL18","v":"13:33:00"},{"$f":"'Skupina 1'!CM18","v":"00:50:00"},{"$f":"'Skupina 1'!CN18","v":"Kristijan HAMZOVSKI"},{"$f":"'Skupina 1'!CO18","v":774},{"$f":"'Skupina 1'!CP18","v":5},{"$f":"'Skupina 1'!CQ18","v":"W"},{"$f":"'Skupina 1'!CR18","v":"Levin TKALČIČ"},{"$f":"'Skupina 1'!CS18","v":720},{"$f":"'Skupina 1'!CT18","v":1},{"$f":"'Skupina 1'!CU18","v":"L"},{"$f":"'Skupina 1'!CV18","v":"F"},{"$f":"'Skupina 1'!CW18","v":true}]
[{"$f":"'Skupina 1'!CE19","v":"1"},{"$f":"'Skupina 1'!CF19","v":18},{"$f":"'Skupina 1'!CG19","v":""},{"$f":"'Skupina 1'!CH19","v":"09:00:00"},{"$f":"'Skupina 1'!CI19","v":0},{"$f":"'Skupina 1'!CJ19","v":""},{"$f":"'Skupina 1'!CK19","v":"00:00:00"},{"$f":"'Skupina 1'!CL19","v":"00:00:00"},{"$f":"'Skupina 1'!CM19","v":""},{"$f":"'Skupina 1'!CN19","v":"Blaž KOLENC"},{"$f":"'Skupina 1'!CO19","v":683},{"$f":"'Skupina 1'!CP19","v":0},{"$f":"'Skupina 1'!CQ19","v":0},{"$f":"'Skupina 1'!CR19","v":""},{"$f":"'Skupina 1'!CS19","v":0},{"$f":"'Skupina 1'!CT19","v":0},{"$f":"'Skupina 1'!CU19","v":0},{"$f":"'Skupina 1'!CV19","v":0},{"$f":"'Skupina 1'!CW19","v":false}]
[{"$f":"'Skupina 1'!CE20","v":"1"},{"$f":"'Skupina 1'!CF20","v":19},{"$f":"'Skupina 1'!CG20","v":""},{"$f":"'Skupina 1'!CH20","v":"09:00:00"},{"$f":"'Skupina 1'!CI20","v":0},{"$f":"'Skupina 1'!CJ20","v":""},{"$f":"'Skupina 1'!CK20","v":"00:00:00"},{"$f":"'Skupina 1'!CL20","v":"00:00:00"},{"$f":"'Skupina 1'!CM20","v":""},{"$f":"'Skupina 1'!CN20","v":""},{"$f":"'Skupina 1'!CO20","v":0},{"$f":"'Skupina 1'!CP20","v":0},{"$f":"'Skupina 1'!CQ20","v":0},{"$f":"'Skupina 1'!CR20","v":""},{"$f":"'Skupina 1'!CS20","v":0},{"$f":"'Skupina 1'!CT20","v":0},{"$f":"'Skupina 1'!CU20","v":0},{"$f":"'Skupina 1'!CV20","v":0},{"$f":"'Skupina 1'!CW20","v":false}]
[{"$f":"'Skupina 1'!CE21","v":"1"},{"$f":"'Skupina 1'!CF21","v":20},{"$f":"'Skupina 1'!CG21","v":"6"},{"$f":"'Skupina 1'!CH21","v":"09:00:00"},{"$f":"'Skupina 1'!CI21","v":5},{"$f":"'Skupina 1'!CJ21","v":""},{"$f":"'Skupina 1'!CK21","v":"12:39:00"},{"$f":"'Skupina 1'!CL21","v":"13:43:00"},{"$f":"'Skupina 1'!CM21","v":"01:04:00"},{"$f":"'Skupina 1'!CN21","v":"Robert REDNAK"},{"$f":"'Skupina 1'!CO21","v":178},{"$f":"'Skupina 1'!CP21","v":4},{"$f":"'Skupina 1'!CQ21","v":"L"},{"$f":"'Skupina 1'!CR21","v":"Maks GERČAR"},{"$f":"'Skupina 1'!CS21","v":888},{"$f":"'Skupina 1'!CT21","v":5},{"$f":"'Skupina 1'!CU21","v":"W"},{"$f":"'Skupina 1'!CV21","v":"F"},{"$f":"'Skupina 1'!CW21","v":true}]
[{"$f":"'Skupina 1'!CE22","v":"1"},{"$f":"'Skupina 1'!CF22","v":21},{"$f":"'Skupina 1'!CG22","v":""},{"$f":"'Skupina 1'!CH22","v":"09:00:00"},{"$f":"'Skupina 1'!CI22","v":0},{"$f":"'Skupina 1'!CJ22","v":""},{"$f":"'Skupina 1'!CK22","v":"00:00:00"},{"$f":"'Skupina 1'!CL22","v":"00:00:00"},{"$f":"'Skupina 1'!CM22","v":""},{"$f":"'Skupina 1'!CN22","v":"Levin TKALČIČ"},{"$f":"'Skupina 1'!CO22","v":720},{"$f":"'Skupina 1'!CP22","v":0},{"$f":"'Skupina 1'!CQ22","v":0},{"$f":"'Skupina 1'!CR22","v":""},{"$f":"'Skupina 1'!CS22","v":0},{"$f":"'Skupina 1'!CT22","v":0},{"$f":"'Skupina 1'!CU22","v":0},{"$f":"'Skupina 1'!CV22","v":0},{"$f":"'Skupina 1'!CW22","v":false}]
[{"$f":"'Skupina 1'!CE23","v":"1"},{"$f":"'Skupina 1'!CF23","v":22},{"$f":"'Skupina 1'!CG23","v":""},{"$f":"'Skupina 1'!CH23","v":"09:00:00"},{"$f":"'Skupina 1'!CI23","v":0},{"$f":"'Skupina 1'!CJ23","v":""},{"$f":"'Skupina 1'!CK23","v":"00:00:00"},{"$f":"'Skupina 1'!CL23","v":"00:00:00"},{"$f":"'Skupina 1'!CM23","v":""},{"$f":"'Skupina 1'!CN23","v":""},{"$f":"'Skupina 1'!CO23","v":0},{"$f":"'Skupina 1'!CP23","v":0},{"$f":"'Skupina 1'!CQ23","v":0},{"$f":"'Skupina 1'!CR23","v":"Kristijan HAMZOVSKI"},{"$f":"'Skupina 1'!CS23","v":774},{"$f":"'Skupina 1'!CT23","v":0},{"$f":"'Skupina 1'!CU23","v":0},{"$f":"'Skupina 1'!CV23","v":0},{"$f":"'Skupina 1'!CW23","v":false}]
[{"$f":"'Skupina 1'!CE24","v":"1"},{"$f":"'Skupina 1'!CF24","v":23},{"$f":"'Skupina 1'!CG24","v":"2"},{"$f":"'Skupina 1'!CH24","v":"09:00:00"},{"$f":"'Skupina 1'!CI24","v":5},{"$f":"'Skupina 1'!CJ24","v":""},{"$f":"'Skupina 1'!CK24","v":"09:10:00"},{"$f":"'Skupina 1'!CL24","v":"10:05:00"},{"$f":"'Skupina 1'!CM24","v":"00:55:00"},{"$f":"'Skupina 1'!CN24","v":"Robert REDNAK"},{"$f":"'Skupina 1'!CO24","v":178},{"$f":"'Skupina 1'!CP24","v":5},{"$f":"'Skupina 1'!CQ24","v":"W"},{"$f":"'Skupina 1'!CR24","v":"Blaž KOLENC"},{"$f":"'Skupina 1'!CS24","v":683},{"$f":"'Skupina 1'!CT24","v":4},{"$f":"'Skupina 1'!CU24","v":"L"},{"$f":"'Skupina 1'!CV24","v":"F"},{"$f":"'Skupina 1'!CW24","v":true}]
[{"$f":"'Skupina 1'!CE25","v":"1"},{"$f":"'Skupina 1'!CF25","v":24},{"$f":"'Skupina 1'!CG25","v":""},{"$f":"'Skupina 1'!CH25","v":"09:00:00"},{"$f":"'Skupina 1'!CI25","v":0},{"$f":"'Skupina 1'!CJ25","v":""},{"$f":"'Skupina 1'!CK25","v":"00:00:00"},{"$f":"'Skupina 1'!CL25","v":"00:00:00"},{"$f":"'Skupina 1'!CM25","v":""},{"$f":"'Skupina 1'!CN25","v":"Maks GERČAR"},{"$f":"'Skupina 1'!CO25","v":888},{"$f":"'Skupina 1'!CP25","v":0},{"$f":"'Skupina 1'!CQ25","v":0},{"$f":"'Skupina 1'!CR25","v":""},{"$f":"'Skupina 1'!CS25","v":0},{"$f":"'Skupina 1'!CT25","v":0},{"$f":"'Skupina 1'!CU25","v":0},{"$f":"'Skupina 1'!CV25","v":0},{"$f":"'Skupina 1'!CW25","v":false}]
[{"$f":"'Skupina 1'!CE26","v":"1"},{"$f":"'Skupina 1'!CF26","v":25},{"$f":"'Skupina 1'!CG26","v":""},{"$f":"'Skupina 1'!CH26","v":"09:00:00"},{"$f":"'Skupina 1'!CI26","v":0},{"$f":"'Skupina 1'!CJ26","v":""},{"$f":"'Skupina 1'!CK26","v":"00:00:00"},{"$f":"'Skupina 1'!CL26","v":"00:00:00"},{"$f":"'Skupina 1'!CM26","v":""},{"$f":"'Skupina 1'!CN26","v":""},{"$f":"'Skupina 1'!CO26","v":0},{"$f":"'Skupina 1'!CP26","v":0},{"$f":"'Skupina 1'!CQ26","v":0},{"$f":"'Skupina 1'!CR26","v":"Levin TKALČIČ"},{"$f":"'Skupina 1'!CS26","v":720},{"$f":"'Skupina 1'!CT26","v":0},{"$f":"'Skupina 1'!CU26","v":0},{"$f":"'Skupina 1'!CV26","v":0},{"$f":"'Skupina 1'!CW26","v":false}]
[{"$f":"'Skupina 1'!CE27","v":"1"},{"$f":"'Skupina 1'!CF27","v":26},{"$f":"'Skupina 1'!CG27","v":""},{"$f":"'Skupina 1'!CH27","v":"09:00:00"},{"$f":"'Skupina 1'!CI27","v":0},{"$f":"'Skupina 1'!CJ27","v":""},{"$f":"'Skupina 1'!CK27","v":"00:00:00"},{"$f":"'Skupina 1'!CL27","v":"00:00:00"},{"$f":"'Skupina 1'!CM27","v":""},{"$f":"'Skupina 1'!CN27","v":""},{"$f":"'Skupina 1'!CO27","v":0},{"$f":"'Skupina 1'!CP27","v":0},{"$f":"'Skupina 1'!CQ27","v":0},{"$f":"'Skupina 1'!CR27","v":""},{"$f":"'Skupina 1'!CS27","v":0},{"$f":"'Skupina 1'!CT27","v":0},{"$f":"'Skupina 1'!CU27","v":0},{"$f":"'Skupina 1'!CV27","v":0},{"$f":"'Skupina 1'!CW27","v":false}]
[{"$f":"'Skupina 1'!CE28","v":"1"},{"$f":"'Skupina 1'!CF28","v":27},{"$f":"'Skupina 1'!CG28","v":"6"},{"$f":"'Skupina 1'!CH28","v":"09:00:00"},{"$f":"'Skupina 1'!CI28","v":5},{"$f":"'Skupina 1'!CJ28","v":""},{"$f":"'Skupina 1'!CK28","v":"11:49:00"},{"$f":"'Skupina 1'!CL28","v":"12:38:00"},{"$f":"'Skupina 1'!CM28","v":"00:49:00"},{"$f":"'Skupina 1'!CN28","v":"Kristijan HAMZOVSKI"},{"$f":"'Skupina 1'!CO28","v":774},{"$f":"'Skupina 1'!CP28","v":5},{"$f":"'Skupina 1'!CQ28","v":"W"},{"$f":"'Skupina 1'!CR28","v":"Robert REDNAK"},{"$f":"'Skupina 1'!CS28","v":178},{"$f":"'Skupina 1'!CT28","v":2},{"$f":"'Skupina 1'!CU28","v":"L"},{"$f":"'Skupina 1'!CV28","v":"F"},{"$f":"'Skupina 1'!CW28","v":true}]
[{"$f":"'Skupina 1'!CE29","v":"1"},{"$f":"'Skupina 1'!CF29","v":28},{"$f":"'Skupina 1'!CG29","v":"6"},{"$f":"'Skupina 1'!CH29","v":"09:00:00"},{"$f":"'Skupina 1'!CI29","v":5},{"$f":"'Skupina 1'!CJ29","v":""},{"$f":"'Skupina 1'!CK29","v":"13:44:00"},{"$f":"'Skupina 1'!CL29","v":"14:27:00"},{"$f":"'Skupina 1'!CM29","v":"00:43:00"},{"$f":"'Skupina 1'!CN29","v":"Blaž KOLENC"},{"$f":"'Skupina 1'!CO29","v":683},{"$f":"'Skupina 1'!CP29","v":5},{"$f":"'Skupina 1'!CQ29","v":"W"},{"$f":"'Skupina 1'!CR29","v":"Maks GERČAR"},{"$f":"'Skupina 1'!CS29","v":888},{"$f":"'Skupina 1'!CT29","v":2},{"$f":"'Skupina 1'!CU29","v":"L"},{"$f":"'Skupina 1'!CV29","v":"F"},{"$f":"'Skupina 1'!CW29","v":true}]
[{"$f":"'Skupina 2'!CE2","v":"2"},{"$f":"'Skupina 2'!CF2","v":1},{"$f":"'Skupina 2'!CG2","v":""},{"$f":"'Skupina 2'!CH2","v":"09:00:00"},{"$f":"'Skupina 2'!CI2","v":0},{"$f":"'Skupina 2'!CJ2","v":""},{"$f":"'Skupina 2'!CK2","v":"00:00:00"},{"$f":"'Skupina 2'!CL2","v":"00:00:00"},{"$f":"'Skupina 2'!CM2","v":"00:00:00"},{"$f":"'Skupina 2'!CN2","v":""},{"$f":"'Skupina 2'!CO2","v":0},{"$f":"'Skupina 2'!CP2","v":0},{"$f":"'Skupina 2'!CQ2","v":0},{"$f":"'Skupina 2'!CR2","v":""},{"$f":"'Skupina 2'!CS2","v":0},{"$f":"'Skupina 2'!CT2","v":0},{"$f":"'Skupina 2'!CU2","v":0},{"$f":"'Skupina 2'!CV2","v":0},{"$f":"'Skupina 2'!CW2","v":false}]
[{"$f":"'Skupina 2'!CE3","v":"2"},{"$f":"'Skupina 2'!CF3","v":2},{"$f":"'Skupina 2'!CG3","v":"4"},{"$f":"'Skupina 2'!CH3","v":"09:00:00"},{"$f":"'Skupina 2'!CI3","v":5},{"$f":"'Skupina 2'!CJ3","v":""},{"$f":"'Skupina 2'!CK3","v":"13:27:00"},{"$f":"'Skupina 2'!CL3","v":"14:45:00"},{"$f":"'Skupina 2'!CM3","v":"01:18:00"},{"$f":"'Skupina 2'!CN3","v":"Beno MESSNER"},{"$f":"'Skupina 2'!CO3","v":538},{"$f":"'Skupina 2'!CP3","v":4},{"$f":"'Skupina 2'!CQ3","v":"L"},{"$f":"'Skupina 2'!CR3","v":"Matej BRAJKOVIČ"},{"$f":"'Skupina 2'!CS3","v":440},{"$f":"'Skupina 2'!CT3","v":5},{"$f":"'Skupina 2'!CU3","v":"W"},{"$f":"'Skupina 2'!CV3","v":"F"},{"$f":"'Skupina 2'!CW3","v":true}]
[{"$f":"'Skupina 2'!CE4","v":"2"},{"$f":"'Skupina 2'!CF4","v":3},{"$f":"'Skupina 2'!CG4","v":"3"},{"$f":"'Skupina 2'!CH4","v":"09:00:00"},{"$f":"'Skupina 2'!CI4","v":5},{"$f":"'Skupina 2'!CJ4","v":""},{"$f":"'Skupina 2'!CK4","v":"09:10:00"},{"$f":"'Skupina 2'!CL4","v":"09:46:00"},{"$f":"'Skupina 2'!CM4","v":"00:36:00"},{"$f":"'Skupina 2'!CN4","v":"Kristijan NIKL"},{"$f":"'Skupina 2'!CO4","v":595},{"$f":"'Skupina 2'!CP4","v":2},{"$f":"'Skupina 2'!CQ4","v":"L"},{"$f":"'Skupina 2'!CR4","v":"Igor BAJSIČ"},{"$f":"'Skupina 2'!CS4","v":799},{"$f":"'Skupina 2'!CT4","v":5},{"$f":"'Skupina 2'!CU4","v":"W"},{"$f":"'Skupina 2'!CV4","v":"F"},{"$f":"'Skupina 2'!CW4","v":true}]
[{"$f":"'Skupina 2'!CE5","v":"2"},{"$f":"'Skupina 2'!CF5","v":4},{"$f":"'Skupina 2'!CG5","v":"4"},{"$f":"'Skupina 2'!CH5","v":"09:00:00"},{"$f":"'Skupina 2'!CI5","v":5},{"$f":"'Skupina 2'!CJ5","v":""},{"$f":"'Skupina 2'!CK5","v":"09:07:00"},{"$f":"'Skupina 2'!CL5","v":"10:08:00"},{"$f":"'Skupina 2'!CM5","v":"01:01:00"},{"$f":"'Skupina 2'!CN5","v":"Janez LAVRIČ"},{"$f":"'Skupina 2'!CO5","v":914},{"$f":"'Skupina 2'!CP5","v":5},{"$f":"'Skupina 2'!CQ5","v":"W"},{"$f":"'Skupina 2'!CR5","v":"Jan HVALEC"},{"$f":"'Skupina 2'!CS5","v":919},{"$f":"'Skupina 2'!CT5","v":3},{"$f":"'Skupina 2'!CU5","v":"L"},{"$f":"'Skupina 2'!CV5","v":"F"},{"$f":"'Skupina 2'!CW5","v":true}]
[{"$f":"'Skupina 2'!CE6","v":"2"},{"$f":"'Skupina 2'!CF6","v":5},{"$f":"'Skupina 2'!CG6","v":""},{"$f":"'Skupina 2'!CH6","v":"09:00:00"},{"$f":"'Skupina 2'!CI6","v":0},{"$f":"'Skupina 2'!CJ6","v":""},{"$f":"'Skupina 2'!CK6","v":"00:00:00"},{"$f":"'Skupina 2'!CL6","v":"00:00:00"},{"$f":"'Skupina 2'!CM6","v":""},{"$f":"'Skupina 2'!CN6","v":"Janez LAVRIČ"},{"$f":"'Skupina 2'!CO6","v":914},{"$f":"'Skupina 2'!CP6","v":0},{"$f":"'Skupina 2'!CQ6","v":0},{"$f":"'Skupina 2'!CR6","v":""},{"$f":"'Skupina 2'!CS6","v":0},{"$f":"'Skupina 2'!CT6","v":0},{"$f":"'Skupina 2'!CU6","v":0},{"$f":"'Skupina 2'!CV6","v":0},{"$f":"'Skupina 2'!CW6","v":false}]
[{"$f":"'Skupina 2'!CE7","v":"2"},{"$f":"'Skupina 2'!CF7","v":6},{"$f":"'Skupina 2'!CG7","v":""},{"$f":"'Skupina 2'!CH7","v":"09:00:00"},{"$f":"'Skupina 2'!CI7","v":0},{"$f":"'Skupina 2'!CJ7","v":""},{"$f":"'Skupina 2'!CK7","v":"00:00:00"},{"$f":"'Skupina 2'!CL7","v":"00:00:00"},{"$f":"'Skupina 2'!CM7","v":""},{"$f":"'Skupina 2'!CN7","v":""},{"$f":"'Skupina 2'!CO7","v":0},{"$f":"'Skupina 2'!CP7","v":0},{"$f":"'Skupina 2'!CQ7","v":0},{"$f":"'Skupina 2'!CR7","v":"Beno MESSNER"},{"$f":"'Skupina 2'!CS7","v":538},{"$f":"'Skupina 2'!CT7","v":0},{"$f":"'Skupina 2'!CU7","v":0},{"$f":"'Skupina 2'!CV7","v":0},{"$f":"'Skupina 2'!CW7","v":false}]
[{"$f":"'Skupina 2'!CE8","v":"2"},{"$f":"'Skupina 2'!CF8","v":7},{"$f":"'Skupina 2'!CG8","v":"3"},{"$f":"'Skupina 2'!CH8","v":"09:00:00"},{"$f":"'Skupina 2'!CI8","v":5},{"$f":"'Skupina 2'!CJ8","v":""},{"$f":"'Skupina 2'!CK8","v":"09:55:00"},{"$f":"'Skupina 2'!CL8","v":"10:28:00"},{"$f":"'Skupina 2'!CM8","v":"00:33:00"},{"$f":"'Skupina 2'!CN8","v":"Matej BRAJKOVIČ"},{"$f":"'Skupina 2'!CO8","v":440},{"$f":"'Skupina 2'!CP8","v":5},{"$f":"'Skupina 2'!CQ8","v":"W"},{"$f":"'Skupina 2'!CR8","v":"Kristijan NIKL"},{"$f":"'Skupina 2'!CS8","v":595},{"$f":"'Skupina 2'!CT8","v":0},{"$f":"'Skupina 2'!CU8","v":"L"},{"$f":"'Skupina 2'!CV8","v":"F"},{"$f":"'Skupina 2'!CW8","v":true}]
[{"$f":"'Skupina 2'!CE9","v":"2"},{"$f":"'Skupina 2'!CF9","v":8},{"$f":"'Skupina 2'!CG9","v":"3"},{"$f":"'Skupina 2'!CH9","v":"09:00:00"},{"$f":"'Skupina 2'!CI9","v":5},{"$f":"'Skupina 2'!CJ9","v":""},{"$f":"'Skupina 2'!CK9","v":"11:46:00"},{"$f":"'Skupina 2'!CL9","v":"12:28:00"},{"$f":"'Skupina 2'!CM9","v":"00:42:00"},{"$f":"'Skupina 2'!CN9","v":"Jan HVALEC"},{"$f":"'Skupina 2'!CO9","v":919},{"$f":"'Skupina 2'!CP9","v":4},{"$f":"'Skupina 2'!CQ9","v":"L"},{"$f":"'Skupina 2'!CR9","v":"Igor BAJSIČ"},{"$f":"'Skupina 2'!CS9","v":799},{"$f":"'Skupina 2'!CT9","v":5},{"$f":"'Skupina 2'!CU9","v":"W"},{"$f":"'Skupina 2'!CV9","v":"F"},{"$f":"'Skupina 2'!CW9","v":true}]
[{"$f":"'Skupina 2'!CE10","v":"2"},{"$f":"'Skupina 2'!CF10","v":9},{"$f":"'Skupina 2'!CG10","v":"4"},{"$f":"'Skupina 2'!CH10","v":"09:00:00"},{"$f":"'Skupina 2'!CI10","v":5},{"$f":"'Skupina 2'!CJ10","v":""},{"$f":"'Skupina 2'!CK10","v":"10:46:00"},{"$f":"'Skupina 2'!CL10","v":"11:55:00"},{"$f":"'Skupina 2'!CM10","v":"01:09:00"},{"$f":"'Skupina 2'!CN10","v":"Beno MESSNER"},{"$f":"'Skupina 2'!CO10","v":538},{"$f":"'Skupina 2'!CP10","v":4},{"$f":"'Skupina 2'!CQ10","v":"L"},{"$f":"'Skupina 2'!CR10","v":"Janez LAVRIČ"},{"$f":"'Skupina 2'!CS10","v":914},{"$f":"'Skupina 2'!CT10","v":5},{"$f":"'Skupina 2'!CU10","v":"W"},{"$f":"'Skupina 2'!CV10","v":"F"},{"$f":"'Skupina 2'!CW10","v":true}]
[{"$f":"'Skupina 2'!CE11","v":"2"},{"$f":"'Skupina 2'!CF11","v":10},{"$f":"'Skupina 2'!CG11","v":""},{"$f":"'Skupina 2'!CH11","v":"09:00:00"},{"$f":"'Skupina 2'!CI11","v":0},{"$f":"'Skupina 2'!CJ11","v":""},{"$f":"'Skupina 2'!CK11","v":"00:00:00"},{"$f":"'Skupina 2'!CL11","v":"00:00:00"},{"$f":"'Skupina 2'!CM11","v":""},{"$f":"'Skupina 2'!CN11","v":"Kristijan NIKL"},{"$f":"'Skupina 2'!CO11","v":595},{"$f":"'Skupina 2'!CP11","v":0},{"$f":"'Skupina 2'!CQ11","v":0},{"$f":"'Skupina 2'!CR11","v":""},{"$f":"'Skupina 2'!CS11","v":0},{"$f":"'Skupina 2'!CT11","v":0},{"$f":"'Skupina 2'!CU11","v":0},{"$f":"'Skupina 2'!CV11","v":0},{"$f":"'Skupina 2'!CW11","v":false}]
[{"$f":"'Skupina 2'!CE12","v":"2"},{"$f":"'Skupina 2'!CF12","v":11},{"$f":"'Skupina 2'!CG12","v":"3"},{"$f":"'Skupina 2'!CH12","v":"09:00:00"},{"$f":"'Skupina 2'!CI12","v":5},{"$f":"'Skupina 2'!CJ12","v":""},{"$f":"'Skupina 2'!CK12","v":"10:29:00"},{"$f":"'Skupina 2'!CL12","v":"11:29:00"},{"$f":"'Skupina 2'!CM12","v":"01:00:00"},{"$f":"'Skupina 2'!CN12","v":"Igor BAJSIČ"},{"$f":"'Skupina 2'!CO12","v":799},{"$f":"'Skupina 2'!CP12","v":3},{"$f":"'Skupina 2'!CQ12","v":"L"},{"$f":"'Skupina 2'!CR12","v":"Matej BRAJKOVIČ"},{"$f":"'Skupina 2'!CS12","v":440},{"$f":"'Skupina 2'!CT12","v":5},{"$f":"'Skupina 2'!CU12","v":"W"},{"$f":"'Skupina 2'!CV12","v":"F"},{"$f":"'Skupina 2'!CW12","v":true}]
[{"$f":"'Skupina 2'!CE13","v":"2"},{"$f":"'Skupina 2'!CF13","v":12},{"$f":"'Skupina 2'!CG13","v":""},{"$f":"'Skupina 2'!CH13","v":"09:00:00"},{"$f":"'Skupina 2'!CI13","v":0},{"$f":"'Skupina 2'!CJ13","v":""},{"$f":"'Skupina 2'!CK13","v":"00:00:00"},{"$f":"'Skupina 2'!CL13","v":"00:00:00"},{"$f":"'Skupina 2'!CM13","v":""},{"$f":"'Skupina 2'!CN13","v":""},{"$f":"'Skupina 2'!CO13","v":0},{"$f":"'Skupina 2'!CP13","v":0},{"$f":"'Skupina 2'!CQ13","v":0},{"$f":"'Skupina 2'!CR13","v":"Jan HVALEC"},{"$f":"'Skupina 2'!CS13","v":919},{"$f":"'Skupina 2'!CT13","v":0},{"$f":"'Skupina 2'!CU13","v":0},{"$f":"'Skupina 2'!CV13","v":0},{"$f":"'Skupina 2'!CW13","v":false}]
[{"$f":"'Skupina 2'!CE14","v":"2"},{"$f":"'Skupina 2'!CF14","v":13},{"$f":"'Skupina 2'!CG14","v":"5"},{"$f":"'Skupina 2'!CH14","v":"09:00:00"},{"$f":"'Skupina 2'!CI14","v":5},{"$f":"'Skupina 2'!CJ14","v":""},{"$f":"'Skupina 2'!CK14","v":"13:31:00"},{"$f":"'Skupina 2'!CL14","v":"14:30:00"},{"$f":"'Skupina 2'!CM14","v":"00:59:00"},{"$f":"'Skupina 2'!CN14","v":"Janez LAVRIČ"},{"$f":"'Skupina 2'!CO14","v":914},{"$f":"'Skupina 2'!CP14","v":4},{"$f":"'Skupina 2'!CQ14","v":"L"},{"$f":"'Skupina 2'!CR14","v":"Kristijan NIKL"},{"$f":"'Skupina 2'!CS14","v":595},{"$f":"'Skupina 2'!CT14","v":5},{"$f":"'Skupina 2'!CU14","v":"W"},{"$f":"'Skupina 2'!CV14","v":"F"},{"$f":"'Skupina 2'!CW14","v":true}]
[{"$f":"'Skupina 2'!CE15","v":"2"},{"$f":"'Skupina 2'!CF15","v":14},{"$f":"'Skupina 2'!CG15","v":""},{"$f":"'Skupina 2'!CH15","v":"09:00:00"},{"$f":"'Skupina 2'!CI15","v":0},{"$f":"'Skupina 2'!CJ15","v":""},{"$f":"'Skupina 2'!CK15","v":"00:00:00"},{"$f":"'Skupina 2'!CL15","v":"00:00:00"},{"$f":"'Skupina 2'!CM15","v":""},{"$f":"'Skupina 2'!CN15","v":""},{"$f":"'Skupina 2'!CO15","v":0},{"$f":"'Skupina 2'!CP15","v":0},{"$f":"'Skupina 2'!CQ15","v":0},{"$f":"'Skupina 2'!CR15","v":"Beno MESSNER"},{"$f":"'Skupina 2'!CS15","v":538},{"$f":"'Skupina 2'!CT15","v":0},{"$f":"'Skupina 2'!CU15","v":0},{"$f":"'Skupina 2'!CV15","v":0},{"$f":"'Skupina 2'!CW15","v":false}]
[{"$f":"'Skupina 2'!CE16","v":"2"},{"$f":"'Skupina 2'!CF16","v":15},{"$f":"'Skupina 2'!CG16","v":""},{"$f":"'Skupina 2'!CH16","v":"09:00:00"},{"$f":"'Skupina 2'!CI16","v":0},{"$f":"'Skupina 2'!CJ16","v":""},{"$f":"'Skupina 2'!CK16","v":"00:00:00"},{"$f":"'Skupina 2'!CL16","v":"00:00:00"},{"$f":"'Skupina 2'!CM16","v":""},{"$f":"'Skupina 2'!CN16","v":""},{"$f":"'Skupina 2'!CO16","v":0},{"$f":"'Skupina 2'!CP16","v":0},{"$f":"'Skupina 2'!CQ16","v":0},{"$f":"'Skupina 2'!CR16","v":"Igor BAJSIČ"},{"$f":"'Skupina 2'!CS16","v":799},{"$f":"'Skupina 2'!CT16","v":0},{"$f":"'Skupina 2'!CU16","v":0},{"$f":"'Skupina 2'!CV16","v":0},{"$f":"'Skupina 2'!CW16","v":false}]
[{"$f":"'Skupina 2'!CE17","v":"2"},{"$f":"'Skupina 2'!CF17","v":16},{"$f":"'Skupina 2'!CG17","v":"3"},{"$f":"'Skupina 2'!CH17","v":"09:00:00"},{"$f":"'Skupina 2'!CI17","v":5},{"$f":"'Skupina 2'!CJ17","v":""},{"$f":"'Skupina 2'!CK17","v":"12:51:00"},{"$f":"'Skupina 2'!CL17","v":"13:26:00"},{"$f":"'Skupina 2'!CM17","v":"00:35:00"},{"$f":"'Skupina 2'!CN17","v":"Jan HVALEC"},{"$f":"'Skupina 2'!CO17","v":919},{"$f":"'Skupina 2'!CP17","v":1},{"$f":"'Skupina 2'!CQ17","v":"L"},{"$f":"'Skupina 2'!CR17","v":"Matej BRAJKOVIČ"},{"$f":"'Skupina 2'!CS17","v":440},{"$f":"'Skupina 2'!CT17","v":5},{"$f":"'Skupina 2'!CU17","v":"W"},{"$f":"'Skupina 2'!CV17","v":"F"},{"$f":"'Skupina 2'!CW17","v":true}]
[{"$f":"'Skupina 2'!CE18","v":"2"},{"$f":"'Skupina 2'!CF18","v":17},{"$f":"'Skupina 2'!CG18","v":"5"},{"$f":"'Skupina 2'!CH18","v":"09:00:00"},{"$f":"'Skupina 2'!CI18","v":5},{"$f":"'Skupina 2'!CJ18","v":""},{"$f":"'Skupina 2'!CK18","v":"12:48:00"},{"$f":"'Skupina 2'!CL18","v":"13:30:00"},{"$f":"'Skupina 2'!CM18","v":"00:42:00"},{"$f":"'Skupina 2'!CN18","v":"Igor BAJSIČ"},{"$f":"'Skupina 2'!CO18","v":799},{"$f":"'Skupina 2'!CP18","v":5},{"$f":"'Skupina 2'!CQ18","v":"W"},{"$f":"'Skupina 2'!CR18","v":"Janez LAVRIČ"},{"$f":"'Skupina 2'!CS18","v":914},{"$f":"'Skupina 2'!CT18","v":2},{"$f":"'Skupina 2'!CU18","v":"L"},{"$f":"'Skupina 2'!CV18","v":"F"},{"$f":"'Skupina 2'!CW18","v":true}]
[{"$f":"'Skupina 2'!CE19","v":"2"},{"$f":"'Skupina 2'!CF19","v":18},{"$f":"'Skupina 2'!CG19","v":""},{"$f":"'Skupina 2'!CH19","v":"09:00:00"},{"$f":"'Skupina 2'!CI19","v":0},{"$f":"'Skupina 2'!CJ19","v":""},{"$f":"'Skupina 2'!CK19","v":"00:00:00"},{"$f":"'Skupina 2'!CL19","v":"00:00:00"},{"$f":"'Skupina 2'!CM19","v":""},{"$f":"'Skupina 2'!CN19","v":"Kristijan NIKL"},{"$f":"'Skupina 2'!CO19","v":595},{"$f":"'Skupina 2'!CP19","v":0},{"$f":"'Skupina 2'!CQ19","v":0},{"$f":"'Skupina 2'!CR19","v":""},{"$f":"'Skupina 2'!CS19","v":0},{"$f":"'Skupina 2'!CT19","v":0},{"$f":"'Skupina 2'!CU19","v":0},{"$f":"'Skupina 2'!CV19","v":0},{"$f":"'Skupina 2'!CW19","v":false}]
[{"$f":"'Skupina 2'!CE20","v":"2"},{"$f":"'Skupina 2'!CF20","v":19},{"$f":"'Skupina 2'!CG20","v":""},{"$f":"'Skupina 2'!CH20","v":"09:00:00"},{"$f":"'Skupina 2'!CI20","v":0},{"$f":"'Skupina 2'!CJ20","v":""},{"$f":"'Skupina 2'!CK20","v":"00:00:00"},{"$f":"'Skupina 2'!CL20","v":"00:00:00"},{"$f":"'Skupina 2'!CM20","v":""},{"$f":"'Skupina 2'!CN20","v":"Matej BRAJKOVIČ"},{"$f":"'Skupina 2'!CO20","v":440},{"$f":"'Skupina 2'!CP20","v":0},{"$f":"'Skupina 2'!CQ20","v":0},{"$f":"'Skupina 2'!CR20","v":""},{"$f":"'Skupina 2'!CS20","v":0},{"$f":"'Skupina 2'!CT20","v":0},{"$f":"'Skupina 2'!CU20","v":0},{"$f":"'Skupina 2'!CV20","v":0},{"$f":"'Skupina 2'!CW20","v":false}]
[{"$f":"'Skupina 2'!CE21","v":"2"},{"$f":"'Skupina 2'!CF21","v":20},{"$f":"'Skupina 2'!CG21","v":"4"},{"$f":"'Skupina 2'!CH21","v":"09:00:00"},{"$f":"'Skupina 2'!CI21","v":5},{"$f":"'Skupina 2'!CJ21","v":""},{"$f":"'Skupina 2'!CK21","v":"10:10:00"},{"$f":"'Skupina 2'!CL21","v":"10:46:00"},{"$f":"'Skupina 2'!CM21","v":"00:36:00"},{"$f":"'Skupina 2'!CN21","v":"Beno MESSNER"},{"$f":"'Skupina 2'!CO21","v":538},{"$f":"'Skupina 2'!CP21","v":5},{"$f":"'Skupina 2'!CQ21","v":"W"},{"$f":"'Skupina 2'!CR21","v":"Jan HVALEC"},{"$f":"'Skupina 2'!CS21","v":919},{"$f":"'Skupina 2'!CT21","v":0},{"$f":"'Skupina 2'!CU21","v":"L"},{"$f":"'Skupina 2'!CV21","v":"F"},{"$f":"'Skupina 2'!CW21","v":true}]
[{"$f":"'Skupina 2'!CE22","v":"2"},{"$f":"'Skupina 2'!CF22","v":21},{"$f":"'Skupina 2'!CG22","v":"5"},{"$f":"'Skupina 2'!CH22","v":"09:00:00"},{"$f":"'Skupina 2'!CI22","v":5},{"$f":"'Skupina 2'!CJ22","v":""},{"$f":"'Skupina 2'!CK22","v":"11:59:00"},{"$f":"'Skupina 2'!CL22","v":"12:48:00"},{"$f":"'Skupina 2'!CM22","v":"00:49:00"},{"$f":"'Skupina 2'!CN22","v":"Janez LAVRIČ"},{"$f":"'Skupina 2'!CO22","v":914},{"$f":"'Skupina 2'!CP22","v":1},{"$f":"'Skupina 2'!CQ22","v":"L"},{"$f":"'Skupina 2'!CR22","v":"Matej BRAJKOVIČ"},{"$f":"'Skupina 2'!CS22","v":440},{"$f":"'Skupina 2'!CT22","v":5},{"$f":"'Skupina 2'!CU22","v":"W"},{"$f":"'Skupina 2'!CV22","v":"F"},{"$f":"'Skupina 2'!CW22","v":true}]
[{"$f":"'Skupina 2'!CE23","v":"2"},{"$f":"'Skupina 2'!CF23","v":22},{"$f":"'Skupina 2'!CG23","v":""},{"$f":"'Skupina 2'!CH23","v":"09:00:00"},{"$f":"'Skupina 2'!CI23","v":0},{"$f":"'Skupina 2'!CJ23","v":""},{"$f":"'Skupina 2'!CK23","v":"00:00:00"},{"$f":"'Skupina 2'!CL23","v":"00:00:00"},{"$f":"'Skupina 2'!CM23","v":""},{"$f":"'Skupina 2'!CN23","v":""},{"$f":"'Skupina 2'!CO23","v":0},{"$f":"'Skupina 2'!CP23","v":0},{"$f":"'Skupina 2'!CQ23","v":0},{"$f":"'Skupina 2'!CR23","v":"Igor BAJSIČ"},{"$f":"'Skupina 2'!CS23","v":799},{"$f":"'Skupina 2'!CT23","v":0},{"$f":"'Skupina 2'!CU23","v":0},{"$f":"'Skupina 2'!CV23","v":0},{"$f":"'Skupina 2'!CW23","v":false}]
[{"$f":"'Skupina 2'!CE24","v":"2"},{"$f":"'Skupina 2'!CF24","v":23},{"$f":"'Skupina 2'!CG24","v":"4"},{"$f":"'Skupina 2'!CH24","v":"09:00:00"},{"$f":"'Skupina 2'!CI24","v":5},{"$f":"'Skupina 2'!CJ24","v":""},{"$f":"'Skupina 2'!CK24","v":"11:59:00"},{"$f":"'Skupina 2'!CL24","v":"12:58:00"},{"$f":"'Skupina 2'!CM24","v":"00:59:00"},{"$f":"'Skupina 2'!CN24","v":"Beno MESSNER"},{"$f":"'Skupina 2'!CO24","v":538},{"$f":"'Skupina 2'!CP24","v":3},{"$f":"'Skupina 2'!CQ24","v":"L"},{"$f":"'Skupina 2'!CR24","v":"Kristijan NIKL"},{"$f":"'Skupina 2'!CS24","v":595},{"$f":"'Skupina 2'!CT24","v":5},{"$f":"'Skupina 2'!CU24","v":"W"},{"$f":"'Skupina 2'!CV24","v":"F"},{"$f":"'Skupina 2'!CW24","v":true}]
[{"$f":"'Skupina 2'!CE25","v":"2"},{"$f":"'Skupina 2'!CF25","v":24},{"$f":"'Skupina 2'!CG25","v":""},{"$f":"'Skupina 2'!CH25","v":"09:00:00"},{"$f":"'Skupina 2'!CI25","v":0},{"$f":"'Skupina 2'!CJ25","v":""},{"$f":"'Skupina 2'!CK25","v":"00:00:00"},{"$f":"'Skupina 2'!CL25","v":"00:00:00"},{"$f":"'Skupina 2'!CM25","v":""},{"$f":"'Skupina 2'!CN25","v":"Jan HVALEC"},{"$f":"'Skupina 2'!CO25","v":919},{"$f":"'Skupina 2'!CP25","v":0},{"$f":"'Skupina 2'!CQ25","v":0},{"$f":"'Skupina 2'!CR25","v":""},{"$f":"'Skupina 2'!CS25","v":0},{"$f":"'Skupina 2'!CT25","v":0},{"$f":"'Skupina 2'!CU25","v":0},{"$f":"'Skupina 2'!CV25","v":0},{"$f":"'Skupina 2'!CW25","v":false}]
[{"$f":"'Skupina 2'!CE26","v":"2"},{"$f":"'Skupina 2'!CF26","v":25},{"$f":"'Skupina 2'!CG26","v":""},{"$f":"'Skupina 2'!CH26","v":"09:00:00"},{"$f":"'Skupina 2'!CI26","v":0},{"$f":"'Skupina 2'!CJ26","v":""},{"$f":"'Skupina 2'!CK26","v":"00:00:00"},{"$f":"'Skupina 2'!CL26","v":"00:00:00"},{"$f":"'Skupina 2'!CM26","v":""},{"$f":"'Skupina 2'!CN26","v":""},{"$f":"'Skupina 2'!CO26","v":0},{"$f":"'Skupina 2'!CP26","v":0},{"$f":"'Skupina 2'!CQ26","v":0},{"$f":"'Skupina 2'!CR26","v":"Janez LAVRIČ"},{"$f":"'Skupina 2'!CS26","v":914},{"$f":"'Skupina 2'!CT26","v":0},{"$f":"'Skupina 2'!CU26","v":0},{"$f":"'Skupina 2'!CV26","v":0},{"$f":"'Skupina 2'!CW26","v":false}]
[{"$f":"'Skupina 2'!CE27","v":"2"},{"$f":"'Skupina 2'!CF27","v":26},{"$f":"'Skupina 2'!CG27","v":""},{"$f":"'Skupina 2'!CH27","v":"09:00:00"},{"$f":"'Skupina 2'!CI27","v":0},{"$f":"'Skupina 2'!CJ27","v":""},{"$f":"'Skupina 2'!CK27","v":"00:00:00"},{"$f":"'Skupina 2'!CL27","v":"00:00:00"},{"$f":"'Skupina 2'!CM27","v":""},{"$f":"'Skupina 2'!CN27","v":"Matej BRAJKOVIČ"},{"$f":"'Skupina 2'!CO27","v":440},{"$f":"'Skupina 2'!CP27","v":0},{"$f":"'Skupina 2'!CQ27","v":0},{"$f":"'Skupina 2'!CR27","v":""},{"$f":"'Skupina 2'!CS27","v":0},{"$f":"'Skupina 2'!CT27","v":0},{"$f":"'Skupina 2'!CU27","v":0},{"$f":"'Skupina 2'!CV27","v":0},{"$f":"'Skupina 2'!CW27","v":false}]
[{"$f":"'Skupina 2'!CE28","v":"2"},{"$f":"'Skupina 2'!CF28","v":27},{"$f":"'Skupina 2'!CG28","v":"4"},{"$f":"'Skupina 2'!CH28","v":"09:00:00"},{"$f":"'Skupina 2'!CI28","v":5},{"$f":"'Skupina 2'!CJ28","v":""},{"$f":"'Skupina 2'!CK28","v":"14:30:00"},{"$f":"'Skupina 2'!CL28","v":"15:34:00"},{"$f":"'Skupina 2'!CM28","v":"01:04:00"},{"$f":"'Skupina 2'!CN28","v":"Igor BAJSIČ"},{"$f":"'Skupina 2'!CO28","v":799},{"$f":"'Skupina 2'!CP28","v":5},{"$f":"'Skupina 2'!CQ28","v":"W"},{"$f":"'Skupina 2'!CR28","v":"Beno MESSNER"},{"$f":"'Skupina 2'!CS28","v":538},{"$f":"'Skupina 2'!CT28","v":4},{"$f":"'Skupina 2'!CU28","v":"L"},{"$f":"'Skupina 2'!CV28","v":"F"},{"$f":"'Skupina 2'!CW28","v":true}]
[{"$f":"'Skupina 2'!CE29","v":"2"},{"$f":"'Skupina 2'!CF29","v":28},{"$f":"'Skupina 2'!CG29","v":"6"},{"$f":"'Skupina 2'!CH29","v":"09:00:00"},{"$f":"'Skupina 2'!CI29","v":5},{"$f":"'Skupina 2'!CJ29","v":""},{"$f":"'Skupina 2'!CK29","v":"11:05:00"},{"$f":"'Skupina 2'!CL29","v":"11:35:00"},{"$f":"'Skupina 2'!CM29","v":"00:30:00"},{"$f":"'Skupina 2'!CN29","v":"Kristijan NIKL"},{"$f":"'Skupina 2'!CO29","v":595},{"$f":"'Skupina 2'!CP29","v":5},{"$f":"'Skupina 2'!CQ29","v":"W"},{"$f":"'Skupina 2'!CR29","v":"Jan HVALEC"},{"$f":"'Skupina 2'!CS29","v":919},{"$f":"'Skupina 2'!CT29","v":1},{"$f":"'Skupina 2'!CU29","v":"L"},{"$f":"'Skupina 2'!CV29","v":"F"},{"$f":"'Skupina 2'!CW29","v":true}]
[{"$f":"'Skupina 3'!CE2","v":"3"},{"$f":"'Skupina 3'!CF2","v":1},{"$f":"'Skupina 3'!CG2","v":""},{"$f":"'Skupina 3'!CH2","v":"09:00:00"},{"$f":"'Skupina 3'!CI2","v":0},{"$f":"'Skupina 3'!CJ2","v":""},{"$f":"'Skupina 3'!CK2","v":"00:00:00"},{"$f":"'Skupina 3'!CL2","v":"00:00:00"},{"$f":"'Skupina 3'!CM2","v":""},{"$f":"'Skupina 3'!CN2","v":""},{"$f":"'Skupina 3'!CO2","v":0},{"$f":"'Skupina 3'!CP2","v":0},{"$f":"'Skupina 3'!CQ2","v":0},{"$f":"'Skupina 3'!CR2","v":""},{"$f":"'Skupina 3'!CS2","v":0},{"$f":"'Skupina 3'!CT2","v":0},{"$f":"'Skupina 3'!CU2","v":0},{"$f":"'Skupina 3'!CV2","v":0},{"$f":"'Skupina 3'!CW2","v":false}]
[{"$f":"'Skupina 3'!CE3","v":"3"},{"$f":"'Skupina 3'!CF3","v":2},{"$f":"'Skupina 3'!CG3","v":"5"},{"$f":"'Skupina 3'!CH3","v":"09:00:00"},{"$f":"'Skupina 3'!CI3","v":5},{"$f":"'Skupina 3'!CJ3","v":""},{"$f":"'Skupina 3'!CK3","v":"10:51:00"},{"$f":"'Skupina 3'!CL3","v":"11:33:00"},{"$f":"'Skupina 3'!CM3","v":"00:42:00"},{"$f":"'Skupina 3'!CN3","v":"Boštjan PEMIČ"},{"$f":"'Skupina 3'!CO3","v":678},{"$f":"'Skupina 3'!CP3","v":2},{"$f":"'Skupina 3'!CQ3","v":"L"},{"$f":"'Skupina 3'!CR3","v":"Miha ŽAGAR"},{"$f":"'Skupina 3'!CS3","v":2},{"$f":"'Skupina 3'!CT3","v":5},{"$f":"'Skupina 3'!CU3","v":"W"},{"$f":"'Skupina 3'!CV3","v":"F"},{"$f":"'Skupina 3'!CW3","v":true}]
[{"$f":"'Skupina 3'!CE4","v":"3"},{"$f":"'Skupina 3'!CF4","v":3},{"$f":"'Skupina 3'!CG4","v":"6"},{"$f":"'Skupina 3'!CH4","v":"09:00:00"},{"$f":"'Skupina 3'!CI4","v":5},{"$f":"'Skupina 3'!CJ4","v":""},{"$f":"'Skupina 3'!CK4","v":"09:11:00"},{"$f":"'Skupina 3'!CL4","v":"11:03:00"},{"$f":"'Skupina 3'!CM4","v":"01:52:00"},{"$f":"'Skupina 3'!CN4","v":"Iztok DOLINŠEK "},{"$f":"'Skupina 3'!CO4","v":111},{"$f":"'Skupina 3'!CP4","v":4},{"$f":"'Skupina 3'!CQ4","v":"L"},{"$f":"'Skupina 3'!CR4","v":"Aleksander RAIŠIČ"},{"$f":"'Skupina 3'!CS4","v":220},{"$f":"'Skupina 3'!CT4","v":5},{"$f":"'Skupina 3'!CU4","v":"W"},{"$f":"'Skupina 3'!CV4","v":"F"},{"$f":"'Skupina 3'!CW4","v":true}]
[{"$f":"'Skupina 3'!CE5","v":"3"},{"$f":"'Skupina 3'!CF5","v":4},{"$f":"'Skupina 3'!CG5","v":"5"},{"$f":"'Skupina 3'!CH5","v":"09:00:00"},{"$f":"'Skupina 3'!CI5","v":5},{"$f":"'Skupina 3'!CJ5","v":""},{"$f":"'Skupina 3'!CK5","v":"09:11:00"},{"$f":"'Skupina 3'!CL5","v":"09:53:00"},{"$f":"'Skupina 3'!CM5","v":"00:42:00"},{"$f":"'Skupina 3'!CN5","v":"Peter FIJAVŽ"},{"$f":"'Skupina 3'!CO5","v":910},{"$f":"'Skupina 3'!CP5","v":5},{"$f":"'Skupina 3'!CQ5","v":"W"},{"$f":"'Skupina 3'!CR5","v":"Jožef GATEJ"},{"$f":"'Skupina 3'!CS5","v":905},{"$f":"'Skupina 3'!CT5","v":3},{"$f":"'Skupina 3'!CU5","v":"L"},{"$f":"'Skupina 3'!CV5","v":"F"},{"$f":"'Skupina 3'!CW5","v":true}]
[{"$f":"'Skupina 3'!CE6","v":"3"},{"$f":"'Skupina 3'!CF6","v":5},{"$f":"'Skupina 3'!CG6","v":""},{"$f":"'Skupina 3'!CH6","v":"09:00:00"},{"$f":"'Skupina 3'!CI6","v":0},{"$f":"'Skupina 3'!CJ6","v":""},{"$f":"'Skupina 3'!CK6","v":"00:00:00"},{"$f":"'Skupina 3'!CL6","v":"00:00:00"},{"$f":"'Skupina 3'!CM6","v":""},{"$f":"'Skupina 3'!CN6","v":"Peter FIJAVŽ"},{"$f":"'Skupina 3'!CO6","v":910},{"$f":"'Skupina 3'!CP6","v":0},{"$f":"'Skupina 3'!CQ6","v":0},{"$f":"'Skupina 3'!CR6","v":""},{"$f":"'Skupina 3'!CS6","v":0},{"$f":"'Skupina 3'!CT6","v":0},{"$f":"'Skupina 3'!CU6","v":0},{"$f":"'Skupina 3'!CV6","v":0},{"$f":"'Skupina 3'!CW6","v":false}]
[{"$f":"'Skupina 3'!CE7","v":"3"},{"$f":"'Skupina 3'!CF7","v":6},{"$f":"'Skupina 3'!CG7","v":""},{"$f":"'Skupina 3'!CH7","v":"09:00:00"},{"$f":"'Skupina 3'!CI7","v":0},{"$f":"'Skupina 3'!CJ7","v":""},{"$f":"'Skupina 3'!CK7","v":"00:00:00"},{"$f":"'Skupina 3'!CL7","v":"00:00:00"},{"$f":"'Skupina 3'!CM7","v":""},{"$f":"'Skupina 3'!CN7","v":""},{"$f":"'Skupina 3'!CO7","v":0},{"$f":"'Skupina 3'!CP7","v":0},{"$f":"'Skupina 3'!CQ7","v":0},{"$f":"'Skupina 3'!CR7","v":"Boštjan PEMIČ"},{"$f":"'Skupina 3'!CS7","v":678},{"$f":"'Skupina 3'!CT7","v":0},{"$f":"'Skupina 3'!CU7","v":0},{"$f":"'Skupina 3'!CV7","v":0},{"$f":"'Skupina 3'!CW7","v":false}]
[{"$f":"'Skupina 3'!CE8","v":"3"},{"$f":"'Skupina 3'!CF8","v":7},{"$f":"'Skupina 3'!CG8","v":"8"},{"$f":"'Skupina 3'!CH8","v":"09:00:00"},{"$f":"'Skupina 3'!CI8","v":5},{"$f":"'Skupina 3'!CJ8","v":""},{"$f":"'Skupina 3'!CK8","v":"14:06:00"},{"$f":"'Skupina 3'!CL8","v":"14:37:00"},{"$f":"'Skupina 3'!CM8","v":"00:31:00"},{"$f":"'Skupina 3'!CN8","v":"Miha ŽAGAR"},{"$f":"'Skupina 3'!CO8","v":2},{"$f":"'Skupina 3'!CP8","v":5},{"$f":"'Skupina 3'!CQ8","v":"W"},{"$f":"'Skupina 3'!CR8","v":"Iztok DOLINŠEK "},{"$f":"'Skupina 3'!CS8","v":111},{"$f":"'Skupina 3'!CT8","v":2},{"$f":"'Skupina 3'!CU8","v":"L"},{"$f":"'Skupina 3'!CV8","v":"F"},{"$f":"'Skupina 3'!CW8","v":true}]
[{"$f":"'Skupina 3'!CE9","v":"3"},{"$f":"'Skupina 3'!CF9","v":8},{"$f":"'Skupina 3'!CG9","v":"2"},{"$f":"'Skupina 3'!CH9","v":"09:00:00"},{"$f":"'Skupina 3'!CI9","v":5},{"$f":"'Skupina 3'!CJ9","v":""},{"$f":"'Skupina 3'!CK9","v":"11:09:00"},{"$f":"'Skupina 3'!CL9","v":"12:33:00"},{"$f":"'Skupina 3'!CM9","v":"01:24:00"},{"$f":"'Skupina 3'!CN9","v":"Jožef GATEJ"},{"$f":"'Skupina 3'!CO9","v":905},{"$f":"'Skupina 3'!CP9","v":4},{"$f":"'Skupina 3'!CQ9","v":"L"},{"$f":"'Skupina 3'!CR9","v":"Aleksander RAIŠIČ"},{"$f":"'Skupina 3'!CS9","v":220},{"$f":"'Skupina 3'!CT9","v":5},{"$f":"'Skupina 3'!CU9","v":"W"},{"$f":"'Skupina 3'!CV9","v":"F"},{"$f":"'Skupina 3'!CW9","v":true}]
[{"$f":"'Skupina 3'!CE10","v":"3"},{"$f":"'Skupina 3'!CF10","v":9},{"$f":"'Skupina 3'!CG10","v":"2"},{"$f":"'Skupina 3'!CH10","v":"09:00:00"},{"$f":"'Skupina 3'!CI10","v":5},{"$f":"'Skupina 3'!CJ10","v":""},{"$f":"'Skupina 3'!CK10","v":"13:25:00"},{"$f":"'Skupina 3'!CL10","v":"14:00:00"},{"$f":"'Skupina 3'!CM10","v":"00:35:00"},{"$f":"'Skupina 3'!CN10","v":"Boštjan PEMIČ"},{"$f":"'Skupina 3'!CO10","v":678},{"$f":"'Skupina 3'!CP10","v":0},{"$f":"'Skupina 3'!CQ10","v":"L"},{"$f":"'Skupina 3'!CR10","v":"Peter FIJAVŽ"},{"$f":"'Skupina 3'!CS10","v":910},{"$f":"'Skupina 3'!CT10","v":5},{"$f":"'Skupina 3'!CU10","v":"W"},{"$f":"'Skupina 3'!CV10","v":"F"},{"$f":"'Skupina 3'!CW10","v":true}]
[{"$f":"'Skupina 3'!CE11","v":"3"},{"$f":"'Skupina 3'!CF11","v":10},{"$f":"'Skupina 3'!CG11","v":""},{"$f":"'Skupina 3'!CH11","v":"09:00:00"},{"$f":"'Skupina 3'!CI11","v":0},{"$f":"'Skupina 3'!CJ11","v":""},{"$f":"'Skupina 3'!CK11","v":"00:00:00"},{"$f":"'Skupina 3'!CL11","v":"00:00:00"},{"$f":"'Skupina 3'!CM11","v":""},{"$f":"'Skupina 3'!CN11","v":"Iztok DOLINŠEK "},{"$f":"'Skupina 3'!CO11","v":111},{"$f":"'Skupina 3'!CP11","v":0},{"$f":"'Skupina 3'!CQ11","v":0},{"$f":"'Skupina 3'!CR11","v":""},{"$f":"'Skupina 3'!CS11","v":0},{"$f":"'Skupina 3'!CT11","v":0},{"$f":"'Skupina 3'!CU11","v":0},{"$f":"'Skupina 3'!CV11","v":0},{"$f":"'Skupina 3'!CW11","v":false}]
[{"$f":"'Skupina 3'!CE12","v":"3"},{"$f":"'Skupina 3'!CF12","v":11},{"$f":"'Skupina 3'!CG12","v":"7"},{"$f":"'Skupina 3'!CH12","v":"09:00:00"},{"$f":"'Skupina 3'!CI12","v":5},{"$f":"'Skupina 3'!CJ12","v":""},{"$f":"'Skupina 3'!CK12","v":"13:23:00"},{"$f":"'Skupina 3'!CL12","v":"14:02:00"},{"$f":"'Skupina 3'!CM12","v":"00:39:00"},{"$f":"'Skupina 3'!CN12","v":"Aleksander RAIŠIČ"},{"$f":"'Skupina 3'!CO12","v":220},{"$f":"'Skupina 3'!CP12","v":5},{"$f":"'Skupina 3'!CQ12","v":"W"},{"$f":"'Skupina 3'!CR12","v":"Miha ŽAGAR"},{"$f":"'Skupina 3'!CS12","v":2},{"$f":"'Skupina 3'!CT12","v":0},{"$f":"'Skupina 3'!CU12","v":"L"},{"$f":"'Skupina 3'!CV12","v":"F"},{"$f":"'Skupina 3'!CW12","v":true}]
[{"$f":"'Skupina 3'!CE13","v":"3"},{"$f":"'Skupina 3'!CF13","v":12},{"$f":"'Skupina 3'!CG13","v":""},{"$f":"'Skupina 3'!CH13","v":"09:00:00"},{"$f":"'Skupina 3'!CI13","v":0},{"$f":"'Skupina 3'!CJ13","v":""},{"$f":"'Skupina 3'!CK13","v":"00:00:00"},{"$f":"'Skupina 3'!CL13","v":"00:00:00"},{"$f":"'Skupina 3'!CM13","v":""},{"$f":"'Skupina 3'!CN13","v":""},{"$f":"'Skupina 3'!CO13","v":0},{"$f":"'Skupina 3'!CP13","v":0},{"$f":"'Skupina 3'!CQ13","v":0},{"$f":"'Skupina 3'!CR13","v":"Jožef GATEJ"},{"$f":"'Skupina 3'!CS13","v":905},{"$f":"'Skupina 3'!CT13","v":0},{"$f":"'Skupina 3'!CU13","v":0},{"$f":"'Skupina 3'!CV13","v":0},{"$f":"'Skupina 3'!CW13","v":false}]
[{"$f":"'Skupina 3'!CE14","v":"3"},{"$f":"'Skupina 3'!CF14","v":13},{"$f":"'Skupina 3'!CG14","v":"7"},{"$f":"'Skupina 3'!CH14","v":"09:00:00"},{"$f":"'Skupina 3'!CI14","v":5},{"$f":"'Skupina 3'!CJ14","v":""},{"$f":"'Skupina 3'!CK14","v":"11:11:00"},{"$f":"'Skupina 3'!CL14","v":"12:16:00"},{"$f":"'Skupina 3'!CM14","v":"01:05:00"},{"$f":"'Skupina 3'!CN14","v":"Peter FIJAVŽ"},{"$f":"'Skupina 3'!CO14","v":910},{"$f":"'Skupina 3'!CP14","v":5},{"$f":"'Skupina 3'!CQ14","v":"W"},{"$f":"'Skupina 3'!CR14","v":"Iztok DOLINŠEK "},{"$f":"'Skupina 3'!CS14","v":111},{"$f":"'Skupina 3'!CT14","v":2},{"$f":"'Skupina 3'!CU14","v":"L"},{"$f":"'Skupina 3'!CV14","v":"F"},{"$f":"'Skupina 3'!CW14","v":true}]
[{"$f":"'Skupina 3'!CE15","v":"3"},{"$f":"'Skupina 3'!CF15","v":14},{"$f":"'Skupina 3'!CG15","v":""},{"$f":"'Skupina 3'!CH15","v":"09:00:00"},{"$f":"'Skupina 3'!CI15","v":0},{"$f":"'Skupina 3'!CJ15","v":""},{"$f":"'Skupina 3'!CK15","v":"00:00:00"},{"$f":"'Skupina 3'!CL15","v":"00:00:00"},{"$f":"'Skupina 3'!CM15","v":""},{"$f":"'Skupina 3'!CN15","v":""},{"$f":"'Skupina 3'!CO15","v":0},{"$f":"'Skupina 3'!CP15","v":0},{"$f":"'Skupina 3'!CQ15","v":0},{"$f":"'Skupina 3'!CR15","v":"Boštjan PEMIČ"},{"$f":"'Skupina 3'!CS15","v":678},{"$f":"'Skupina 3'!CT15","v":0},{"$f":"'Skupina 3'!CU15","v":0},{"$f":"'Skupina 3'!CV15","v":0},{"$f":"'Skupina 3'!CW15","v":false}]
[{"$f":"'Skupina 3'!CE16","v":"3"},{"$f":"'Skupina 3'!CF16","v":15},{"$f":"'Skupina 3'!CG16","v":""},{"$f":"'Skupina 3'!CH16","v":"09:00:00"},{"$f":"'Skupina 3'!CI16","v":0},{"$f":"'Skupina 3'!CJ16","v":""},{"$f":"'Skupina 3'!CK16","v":"00:00:00"},{"$f":"'Skupina 3'!CL16","v":"00:00:00"},{"$f":"'Skupina 3'!CM16","v":""},{"$f":"'Skupina 3'!CN16","v":""},{"$f":"'Skupina 3'!CO16","v":0},{"$f":"'Skupina 3'!CP16","v":0},{"$f":"'Skupina 3'!CQ16","v":0},{"$f":"'Skupina 3'!CR16","v":"Aleksander RAIŠIČ"},{"$f":"'Skupina 3'!CS16","v":220},{"$f":"'Skupina 3'!CT16","v":0},{"$f":"'Skupina 3'!CU16","v":0},{"$f":"'Skupina 3'!CV16","v":0},{"$f":"'Skupina 3'!CW16","v":false}]
[{"$f":"'Skupina 3'!CE17","v":"3"},{"$f":"'Skupina 3'!CF17","v":16},{"$f":"'Skupina 3'!CG17","v":"8"},{"$f":"'Skupina 3'!CH17","v":"09:00:00"},{"$f":"'Skupina 3'!CI17","v":5},{"$f":"'Skupina 3'!CJ17","v":""},{"$f":"'Skupina 3'!CK17","v":"12:36:00"},{"$f":"'Skupina 3'!CL17","v":"13:13:00"},{"$f":"'Skupina 3'!CM17","v":"00:37:00"},{"$f":"'Skupina 3'!CN17","v":"Jožef GATEJ"},{"$f":"'Skupina 3'!CO17","v":905},{"$f":"'Skupina 3'!CP17","v":5},{"$f":"'Skupina 3'!CQ17","v":"W"},{"$f":"'Skupina 3'!CR17","v":"Miha ŽAGAR"},{"$f":"'Skupina 3'!CS17","v":2},{"$f":"'Skupina 3'!CT17","v":2},{"$f":"'Skupina 3'!CU17","v":"L"},{"$f":"'Skupina 3'!CV17","v":"F"},{"$f":"'Skupina 3'!CW17","v":true}]
[{"$f":"'Skupina 3'!CE18","v":"3"},{"$f":"'Skupina 3'!CF18","v":17},{"$f":"'Skupina 3'!CG18","v":"2"},{"$f":"'Skupina 3'!CH18","v":"09:00:00"},{"$f":"'Skupina 3'!CI18","v":5},{"$f":"'Skupina 3'!CJ18","v":""},{"$f":"'Skupina 3'!CK18","v":"12:36:00"},{"$f":"'Skupina 3'!CL18","v":"13:21:00"},{"$f":"'Skupina 3'!CM18","v":"00:45:00"},{"$f":"'Skupina 3'!CN18","v":"Aleksander RAIŠIČ"},{"$f":"'Skupina 3'!CO18","v":220},{"$f":"'Skupina 3'!CP18","v":5},{"$f":"'Skupina 3'!CQ18","v":"W"},{"$f":"'Skupina 3'!CR18","v":"Peter FIJAVŽ"},{"$f":"'Skupina 3'!CS18","v":910},{"$f":"'Skupina 3'!CT18","v":1},{"$f":"'Skupina 3'!CU18","v":"L"},{"$f":"'Skupina 3'!CV18","v":"F"},{"$f":"'Skupina 3'!CW18","v":true}]
[{"$f":"'Skupina 3'!CE19","v":"3"},{"$f":"'Skupina 3'!CF19","v":18},{"$f":"'Skupina 3'!CG19","v":""},{"$f":"'Skupina 3'!CH19","v":"09:00:00"},{"$f":"'Skupina 3'!CI19","v":0},{"$f":"'Skupina 3'!CJ19","v":""},{"$f":"'Skupina 3'!CK19","v":"00:00:00"},{"$f":"'Skupina 3'!CL19","v":"00:00:00"},{"$f":"'Skupina 3'!CM19","v":""},{"$f":"'Skupina 3'!CN19","v":"Iztok DOLINŠEK "},{"$f":"'Skupina 3'!CO19","v":111},{"$f":"'Skupina 3'!CP19","v":0},{"$f":"'Skupina 3'!CQ19","v":0},{"$f":"'Skupina 3'!CR19","v":""},{"$f":"'Skupina 3'!CS19","v":0},{"$f":"'Skupina 3'!CT19","v":0},{"$f":"'Skupina 3'!CU19","v":0},{"$f":"'Skupina 3'!CV19","v":0},{"$f":"'Skupina 3'!CW19","v":false}]
[{"$f":"'Skupina 3'!CE20","v":"3"},{"$f":"'Skupina 3'!CF20","v":19},{"$f":"'Skupina 3'!CG20","v":""},{"$f":"'Skupina 3'!CH20","v":"09:00:00"},{"$f":"'Skupina 3'!CI20","v":0},{"$f":"'Skupina 3'!CJ20","v":""},{"$f":"'Skupina 3'!CK20","v":"00:00:00"},{"$f":"'Skupina 3'!CL20","v":"00:00:00"},{"$f":"'Skupina 3'!CM20","v":""},{"$f":"'Skupina 3'!CN20","v":"Miha ŽAGAR"},{"$f":"'Skupina 3'!CO20","v":2},{"$f":"'Skupina 3'!CP20","v":0},{"$f":"'Skupina 3'!CQ20","v":0},{"$f":"'Skupina 3'!CR20","v":""},{"$f":"'Skupina 3'!CS20","v":0},{"$f":"'Skupina 3'!CT20","v":0},{"$f":"'Skupina 3'!CU20","v":0},{"$f":"'Skupina 3'!CV20","v":0},{"$f":"'Skupina 3'!CW20","v":false}]
[{"$f":"'Skupina 3'!CE21","v":"3"},{"$f":"'Skupina 3'!CF21","v":20},{"$f":"'Skupina 3'!CG21","v":"7"},{"$f":"'Skupina 3'!CH21","v":"09:00:00"},{"$f":"'Skupina 3'!CI21","v":5},{"$f":"'Skupina 3'!CJ21","v":""},{"$f":"'Skupina 3'!CK21","v":"14:44:00"},{"$f":"'Skupina 3'!CL21","v":"15:23:00"},{"$f":"'Skupina 3'!CM21","v":"00:39:00"},{"$f":"'Skupina 3'!CN21","v":"Boštjan PEMIČ"},{"$f":"'Skupina 3'!CO21","v":678},{"$f":"'Skupina 3'!CP21","v":1},{"$f":"'Skupina 3'!CQ21","v":"L"},{"$f":"'Skupina 3'!CR21","v":"Jožef GATEJ"},{"$f":"'Skupina 3'!CS21","v":905},{"$f":"'Skupina 3'!CT21","v":5},{"$f":"'Skupina 3'!CU21","v":"W"},{"$f":"'Skupina 3'!CV21","v":"F"},{"$f":"'Skupina 3'!CW21","v":true}]
[{"$f":"'Skupina 3'!CE22","v":"3"},{"$f":"'Skupina 3'!CF22","v":21},{"$f":"'Skupina 3'!CG22","v":"5"},{"$f":"'Skupina 3'!CH22","v":"09:00:00"},{"$f":"'Skupina 3'!CI22","v":5},{"$f":"'Skupina 3'!CJ22","v":""},{"$f":"'Skupina 3'!CK22","v":"09:58:00"},{"$f":"'Skupina 3'!CL22","v":"10:49:00"},{"$f":"'Skupina 3'!CM22","v":"00:51:00"},{"$f":"'Skupina 3'!CN22","v":"Peter FIJAVŽ"},{"$f":"'Skupina 3'!CO22","v":910},{"$f":"'Skupina 3'!CP22","v":1},{"$f":"'Skupina 3'!CQ22","v":"L"},{"$f":"'Skupina 3'!CR22","v":"Miha ŽAGAR"},{"$f":"'Skupina 3'!CS22","v":2},{"$f":"'Skupina 3'!CT22","v":5},{"$f":"'Skupina 3'!CU22","v":"W"},{"$f":"'Skupina 3'!CV22","v":"F"},{"$f":"'Skupina 3'!CW22","v":true}]
[{"$f":"'Skupina 3'!CE23","v":"3"},{"$f":"'Skupina 3'!CF23","v":22},{"$f":"'Skupina 3'!CG23","v":""},{"$f":"'Skupina 3'!CH23","v":"09:00:00"},{"$f":"'Skupina 3'!CI23","v":0},{"$f":"'Skupina 3'!CJ23","v":""},{"$f":"'Skupina 3'!CK23","v":"00:00:00"},{"$f":"'Skupina 3'!CL23","v":"00:00:00"},{"$f":"'Skupina 3'!CM23","v":""},{"$f":"'Skupina 3'!CN23","v":""},{"$f":"'Skupina 3'!CO23","v":0},{"$f":"'Skupina 3'!CP23","v":0},{"$f":"'Skupina 3'!CQ23","v":0},{"$f":"'Skupina 3'!CR23","v":"Aleksander RAIŠIČ"},{"$f":"'Skupina 3'!CS23","v":220},{"$f":"'Skupina 3'!CT23","v":0},{"$f":"'Skupina 3'!CU23","v":0},{"$f":"'Skupina 3'!CV23","v":0},{"$f":"'Skupina 3'!CW23","v":false}]
[{"$f":"'Skupina 3'!CE24","v":"3"},{"$f":"'Skupina 3'!CF24","v":23},{"$f":"'Skupina 3'!CG24","v":"7"},{"$f":"'Skupina 3'!CH24","v":"09:00:00"},{"$f":"'Skupina 3'!CI24","v":5},{"$f":"'Skupina 3'!CJ24","v":""},{"$f":"'Skupina 3'!CK24","v":"12:17:00"},{"$f":"'Skupina 3'!CL24","v":"13:06:00"},{"$f":"'Skupina 3'!CM24","v":"00:49:00"},{"$f":"'Skupina 3'!CN24","v":"Boštjan PEMIČ"},{"$f":"'Skupina 3'!CO24","v":678},{"$f":"'Skupina 3'!CP24","v":4},{"$f":"'Skupina 3'!CQ24","v":"L"},{"$f":"'Skupina 3'!CR24","v":"Iztok DOLINŠEK "},{"$f":"'Skupina 3'!CS24","v":111},{"$f":"'Skupina 3'!CT24","v":5},{"$f":"'Skupina 3'!CU24","v":"W"},{"$f":"'Skupina 3'!CV24","v":"F"},{"$f":"'Skupina 3'!CW24","v":true}]
[{"$f":"'Skupina 3'!CE25","v":"3"},{"$f":"'Skupina 3'!CF25","v":24},{"$f":"'Skupina 3'!CG25","v":""},{"$f":"'Skupina 3'!CH25","v":"09:00:00"},{"$f":"'Skupina 3'!CI25","v":0},{"$f":"'Skupina 3'!CJ25","v":""},{"$f":"'Skupina 3'!CK25","v":"00:00:00"},{"$f":"'Skupina 3'!CL25","v":"00:00:00"},{"$f":"'Skupina 3'!CM25","v":""},{"$f":"'Skupina 3'!CN25","v":"Jožef GATEJ"},{"$f":"'Skupina 3'!CO25","v":905},{"$f":"'Skupina 3'!CP25","v":0},{"$f":"'Skupina 3'!CQ25","v":0},{"$f":"'Skupina 3'!CR25","v":""},{"$f":"'Skupina 3'!CS25","v":0},{"$f":"'Skupina 3'!CT25","v":0},{"$f":"'Skupina 3'!CU25","v":0},{"$f":"'Skupina 3'!CV25","v":0},{"$f":"'Skupina 3'!CW25","v":false}]
[{"$f":"'Skupina 3'!CE26","v":"3"},{"$f":"'Skupina 3'!CF26","v":25},{"$f":"'Skupina 3'!CG26","v":""},{"$f":"'Skupina 3'!CH26","v":"09:00:00"},{"$f":"'Skupina 3'!CI26","v":0},{"$f":"'Skupina 3'!CJ26","v":""},{"$f":"'Skupina 3'!CK26","v":"00:00:00"},{"$f":"'Skupina 3'!CL26","v":"00:00:00"},{"$f":"'Skupina 3'!CM26","v":""},{"$f":"'Skupina 3'!CN26","v":""},{"$f":"'Skupina 3'!CO26","v":0},{"$f":"'Skupina 3'!CP26","v":0},{"$f":"'Skupina 3'!CQ26","v":0},{"$f":"'Skupina 3'!CR26","v":"Peter FIJAVŽ"},{"$f":"'Skupina 3'!CS26","v":910},{"$f":"'Skupina 3'!CT26","v":0},{"$f":"'Skupina 3'!CU26","v":0},{"$f":"'Skupina 3'!CV26","v":0},{"$f":"'Skupina 3'!CW26","v":false}]
[{"$f":"'Skupina 3'!CE27","v":"3"},{"$f":"'Skupina 3'!CF27","v":26},{"$f":"'Skupina 3'!CG27","v":""},{"$f":"'Skupina 3'!CH27","v":"09:00:00"},{"$f":"'Skupina 3'!CI27","v":0},{"$f":"'Skupina 3'!CJ27","v":""},{"$f":"'Skupina 3'!CK27","v":"00:00:00"},{"$f":"'Skupina 3'!CL27","v":"00:00:00"},{"$f":"'Skupina 3'!CM27","v":""},{"$f":"'Skupina 3'!CN27","v":"Miha ŽAGAR"},{"$f":"'Skupina 3'!CO27","v":2},{"$f":"'Skupina 3'!CP27","v":0},{"$f":"'Skupina 3'!CQ27","v":0},{"$f":"'Skupina 3'!CR27","v":""},{"$f":"'Skupina 3'!CS27","v":0},{"$f":"'Skupina 3'!CT27","v":0},{"$f":"'Skupina 3'!CU27","v":0},{"$f":"'Skupina 3'!CV27","v":0},{"$f":"'Skupina 3'!CW27","v":false}]
[{"$f":"'Skupina 3'!CE28","v":"3"},{"$f":"'Skupina 3'!CF28","v":27},{"$f":"'Skupina 3'!CG28","v":"7"},{"$f":"'Skupina 3'!CH28","v":"09:00:00"},{"$f":"'Skupina 3'!CI28","v":5},{"$f":"'Skupina 3'!CJ28","v":""},{"$f":"'Skupina 3'!CK28","v":"14:04:00"},{"$f":"'Skupina 3'!CL28","v":"14:43:00"},{"$f":"'Skupina 3'!CM28","v":"00:39:00"},{"$f":"'Skupina 3'!CN28","v":"Aleksander RAIŠIČ"},{"$f":"'Skupina 3'!CO28","v":220},{"$f":"'Skupina 3'!CP28","v":1},{"$f":"'Skupina 3'!CQ28","v":"L"},{"$f":"'Skupina 3'!CR28","v":"Boštjan PEMIČ"},{"$f":"'Skupina 3'!CS28","v":678},{"$f":"'Skupina 3'!CT28","v":5},{"$f":"'Skupina 3'!CU28","v":"W"},{"$f":"'Skupina 3'!CV28","v":"F"},{"$f":"'Skupina 3'!CW28","v":true}]
[{"$f":"'Skupina 3'!CE29","v":"3"},{"$f":"'Skupina 3'!CF29","v":28},{"$f":"'Skupina 3'!CG29","v":"8"},{"$f":"'Skupina 3'!CH29","v":"09:00:00"},{"$f":"'Skupina 3'!CI29","v":5},{"$f":"'Skupina 3'!CJ29","v":""},{"$f":"'Skupina 3'!CK29","v":"13:19:00"},{"$f":"'Skupina 3'!CL29","v":"14:03:00"},{"$f":"'Skupina 3'!CM29","v":"00:44:00"},{"$f":"'Skupina 3'!CN29","v":"Iztok DOLINŠEK "},{"$f":"'Skupina 3'!CO29","v":111},{"$f":"'Skupina 3'!CP29","v":5},{"$f":"'Skupina 3'!CQ29","v":"W"},{"$f":"'Skupina 3'!CR29","v":"Jožef GATEJ"},{"$f":"'Skupina 3'!CS29","v":905},{"$f":"'Skupina 3'!CT29","v":1},{"$f":"'Skupina 3'!CU29","v":"L"},{"$f":"'Skupina 3'!CV29","v":"F"},{"$f":"'Skupina 3'!CW29","v":true}]
[{"$f":"'Skupina 4'!CE2","v":"4"},{"$f":"'Skupina 4'!CF2","v":1},{"$f":"'Skupina 4'!CG2","v":""},{"$f":"'Skupina 4'!CH2","v":"09:00:00"},{"$f":"'Skupina 4'!CI2","v":0},{"$f":"'Skupina 4'!CJ2","v":""},{"$f":"'Skupina 4'!CK2","v":"00:00:00"},{"$f":"'Skupina 4'!CL2","v":"00:00:00"},{"$f":"'Skupina 4'!CM2","v":""},{"$f":"'Skupina 4'!CN2","v":""},{"$f":"'Skupina 4'!CO2","v":0},{"$f":"'Skupina 4'!CP2","v":0},{"$f":"'Skupina 4'!CQ2","v":0},{"$f":"'Skupina 4'!CR2","v":""},{"$f":"'Skupina 4'!CS2","v":0},{"$f":"'Skupina 4'!CT2","v":0},{"$f":"'Skupina 4'!CU2","v":0},{"$f":"'Skupina 4'!CV2","v":0},{"$f":"'Skupina 4'!CW2","v":false}]
[{"$f":"'Skupina 4'!CE3","v":"4"},{"$f":"'Skupina 4'!CF3","v":2},{"$f":"'Skupina 4'!CG3","v":""},{"$f":"'Skupina 4'!CH3","v":"09:00:00"},{"$f":"'Skupina 4'!CI3","v":0},{"$f":"'Skupina 4'!CJ3","v":""},{"$f":"'Skupina 4'!CK3","v":"00:00:00"},{"$f":"'Skupina 4'!CL3","v":"00:00:00"},{"$f":"'Skupina 4'!CM3","v":""},{"$f":"'Skupina 4'!CN3","v":""},{"$f":"'Skupina 4'!CO3","v":0},{"$f":"'Skupina 4'!CP3","v":0},{"$f":"'Skupina 4'!CQ3","v":0},{"$f":"'Skupina 4'!CR3","v":"Tomaž BENEDIČIČ"},{"$f":"'Skupina 4'!CS3","v":1},{"$f":"'Skupina 4'!CT3","v":0},{"$f":"'Skupina 4'!CU3","v":0},{"$f":"'Skupina 4'!CV3","v":0},{"$f":"'Skupina 4'!CW3","v":false}]
[{"$f":"'Skupina 4'!CE4","v":"4"},{"$f":"'Skupina 4'!CF4","v":3},{"$f":"'Skupina 4'!CG4","v":""},{"$f":"'Skupina 4'!CH4","v":"09:00:00"},{"$f":"'Skupina 4'!CI4","v":5},{"$f":"'Skupina 4'!CJ4","v":""},{"$f":"'Skupina 4'!CK4","v":"11:11:00"},{"$f":"'Skupina 4'!CL4","v":"11:12:00"},{"$f":"'Skupina 4'!CM4","v":"00:01:00"},{"$f":"'Skupina 4'!CN4","v":"Nino PORIČ"},{"$f":"'Skupina 4'!CO4","v":866},{"$f":"'Skupina 4'!CP4","v":0},{"$f":"'Skupina 4'!CQ4","v":"WO"},{"$f":"'Skupina 4'!CR4","v":"Lovro KOKOT"},{"$f":"'Skupina 4'!CS4","v":915},{"$f":"'Skupina 4'!CT4","v":0},{"$f":"'Skupina 4'!CU4","v":"DNS"},{"$f":"'Skupina 4'!CV4","v":"F"},{"$f":"'Skupina 4'!CW4","v":true}]
[{"$f":"'Skupina 4'!CE5","v":"4"},{"$f":"'Skupina 4'!CF5","v":4},{"$f":"'Skupina 4'!CG5","v":""},{"$f":"'Skupina 4'!CH5","v":"09:00:00"},{"$f":"'Skupina 4'!CI5","v":5},{"$f":"'Skupina 4'!CJ5","v":""},{"$f":"'Skupina 4'!CK5","v":"10:22:00"},{"$f":"'Skupina 4'!CL5","v":"10:23:00"},{"$f":"'Skupina 4'!CM5","v":"00:01:00"},{"$f":"'Skupina 4'!CN5","v":"Franci ČUČNIK"},{"$f":"'Skupina 4'!CO5","v":891},{"$f":"'Skupina 4'!CP5","v":0},{"$f":"'Skupina 4'!CQ5","v":"WO"},{"$f":"'Skupina 4'!CR5","v":"Sašo MEŽEK"},{"$f":"'Skupina 4'!CS5","v":689},{"$f":"'Skupina 4'!CT5","v":0},{"$f":"'Skupina 4'!CU5","v":"DNS"},{"$f":"'Skupina 4'!CV5","v":"F"},{"$f":"'Skupina 4'!CW5","v":true}]
[{"$f":"'Skupina 4'!CE6","v":"4"},{"$f":"'Skupina 4'!CF6","v":5},{"$f":"'Skupina 4'!CG6","v":""},{"$f":"'Skupina 4'!CH6","v":"09:00:00"},{"$f":"'Skupina 4'!CI6","v":0},{"$f":"'Skupina 4'!CJ6","v":""},{"$f":"'Skupina 4'!CK6","v":"00:00:00"},{"$f":"'Skupina 4'!CL6","v":"00:00:00"},{"$f":"'Skupina 4'!CM6","v":""},{"$f":"'Skupina 4'!CN6","v":"Franci ČUČNIK"},{"$f":"'Skupina 4'!CO6","v":891},{"$f":"'Skupina 4'!CP6","v":0},{"$f":"'Skupina 4'!CQ6","v":0},{"$f":"'Skupina 4'!CR6","v":""},{"$f":"'Skupina 4'!CS6","v":0},{"$f":"'Skupina 4'!CT6","v":0},{"$f":"'Skupina 4'!CU6","v":0},{"$f":"'Skupina 4'!CV6","v":0},{"$f":"'Skupina 4'!CW6","v":false}]
[{"$f":"'Skupina 4'!CE7","v":"4"},{"$f":"'Skupina 4'!CF7","v":6},{"$f":"'Skupina 4'!CG7","v":""},{"$f":"'Skupina 4'!CH7","v":"09:00:00"},{"$f":"'Skupina 4'!CI7","v":0},{"$f":"'Skupina 4'!CJ7","v":""},{"$f":"'Skupina 4'!CK7","v":"00:00:00"},{"$f":"'Skupina 4'!CL7","v":"00:00:00"},{"$f":"'Skupina 4'!CM7","v":""},{"$f":"'Skupina 4'!CN7","v":""},{"$f":"'Skupina 4'!CO7","v":0},{"$f":"'Skupina 4'!CP7","v":0},{"$f":"'Skupina 4'!CQ7","v":0},{"$f":"'Skupina 4'!CR7","v":""},{"$f":"'Skupina 4'!CS7","v":0},{"$f":"'Skupina 4'!CT7","v":0},{"$f":"'Skupina 4'!CU7","v":0},{"$f":"'Skupina 4'!CV7","v":0},{"$f":"'Skupina 4'!CW7","v":false}]
[{"$f":"'Skupina 4'!CE8","v":"4"},{"$f":"'Skupina 4'!CF8","v":7},{"$f":"'Skupina 4'!CG8","v":"7"},{"$f":"'Skupina 4'!CH8","v":"09:00:00"},{"$f":"'Skupina 4'!CI8","v":5},{"$f":"'Skupina 4'!CJ8","v":""},{"$f":"'Skupina 4'!CK8","v":"10:48:00"},{"$f":"'Skupina 4'!CL8","v":"11:23:00"},{"$f":"'Skupina 4'!CM8","v":"00:35:00"},{"$f":"'Skupina 4'!CN8","v":"Tomaž BENEDIČIČ"},{"$f":"'Skupina 4'!CO8","v":1},{"$f":"'Skupina 4'!CP8","v":0},{"$f":"'Skupina 4'!CQ8","v":"L"},{"$f":"'Skupina 4'!CR8","v":"Nino PORIČ"},{"$f":"'Skupina 4'!CS8","v":866},{"$f":"'Skupina 4'!CT8","v":5},{"$f":"'Skupina 4'!CU8","v":"W"},{"$f":"'Skupina 4'!CV8","v":"F"},{"$f":"'Skupina 4'!CW8","v":true}]
[{"$f":"'Skupina 4'!CE9","v":"4"},{"$f":"'Skupina 4'!CF9","v":8},{"$f":"'Skupina 4'!CG9","v":""},{"$f":"'Skupina 4'!CH9","v":"09:00:00"},{"$f":"'Skupina 4'!CI9","v":5},{"$f":"'Skupina 4'!CJ9","v":""},{"$f":"'Skupina 4'!CK9","v":"10:22:00"},{"$f":"'Skupina 4'!CL9","v":"10:23:00"},{"$f":"'Skupina 4'!CM9","v":"00:01:00"},{"$f":"'Skupina 4'!CN9","v":"Sašo MEŽEK"},{"$f":"'Skupina 4'!CO9","v":689},{"$f":"'Skupina 4'!CP9","v":0},{"$f":"'Skupina 4'!CQ9","v":"DNS"},{"$f":"'Skupina 4'!CR9","v":"Lovro KOKOT"},{"$f":"'Skupina 4'!CS9","v":915},{"$f":"'Skupina 4'!CT9","v":0},{"$f":"'Skupina 4'!CU9","v":"WO"},{"$f":"'Skupina 4'!CV9","v":"F"},{"$f":"'Skupina 4'!CW9","v":true}]
[{"$f":"'Skupina 4'!CE10","v":"4"},{"$f":"'Skupina 4'!CF10","v":9},{"$f":"'Skupina 4'!CG10","v":""},{"$f":"'Skupina 4'!CH10","v":"09:00:00"},{"$f":"'Skupina 4'!CI10","v":0},{"$f":"'Skupina 4'!CJ10","v":""},{"$f":"'Skupina 4'!CK10","v":"00:00:00"},{"$f":"'Skupina 4'!CL10","v":"00:00:00"},{"$f":"'Skupina 4'!CM10","v":""},{"$f":"'Skupina 4'!CN10","v":""},{"$f":"'Skupina 4'!CO10","v":0},{"$f":"'Skupina 4'!CP10","v":0},{"$f":"'Skupina 4'!CQ10","v":0},{"$f":"'Skupina 4'!CR10","v":"Franci ČUČNIK"},{"$f":"'Skupina 4'!CS10","v":891},{"$f":"'Skupina 4'!CT10","v":0},{"$f":"'Skupina 4'!CU10","v":0},{"$f":"'Skupina 4'!CV10","v":0},{"$f":"'Skupina 4'!CW10","v":false}]
[{"$f":"'Skupina 4'!CE11","v":"4"},{"$f":"'Skupina 4'!CF11","v":10},{"$f":"'Skupina 4'!CG11","v":""},{"$f":"'Skupina 4'!CH11","v":"09:00:00"},{"$f":"'Skupina 4'!CI11","v":0},{"$f":"'Skupina 4'!CJ11","v":""},{"$f":"'Skupina 4'!CK11","v":"00:00:00"},{"$f":"'Skupina 4'!CL11","v":"00:00:00"},{"$f":"'Skupina 4'!CM11","v":""},{"$f":"'Skupina 4'!CN11","v":"Nino PORIČ"},{"$f":"'Skupina 4'!CO11","v":866},{"$f":"'Skupina 4'!CP11","v":0},{"$f":"'Skupina 4'!CQ11","v":0},{"$f":"'Skupina 4'!CR11","v":""},{"$f":"'Skupina 4'!CS11","v":0},{"$f":"'Skupina 4'!CT11","v":0},{"$f":"'Skupina 4'!CU11","v":0},{"$f":"'Skupina 4'!CV11","v":0},{"$f":"'Skupina 4'!CW11","v":false}]
[{"$f":"'Skupina 4'!CE12","v":"4"},{"$f":"'Skupina 4'!CF12","v":11},{"$f":"'Skupina 4'!CG12","v":"8"},{"$f":"'Skupina 4'!CH12","v":"09:00:00"},{"$f":"'Skupina 4'!CI12","v":5},{"$f":"'Skupina 4'!CJ12","v":""},{"$f":"'Skupina 4'!CK12","v":"09:15:00"},{"$f":"'Skupina 4'!CL12","v":"09:53:00"},{"$f":"'Skupina 4'!CM12","v":"00:38:00"},{"$f":"'Skupina 4'!CN12","v":"Lovro KOKOT"},{"$f":"'Skupina 4'!CO12","v":915},{"$f":"'Skupina 4'!CP12","v":1},{"$f":"'Skupina 4'!CQ12","v":"L"},{"$f":"'Skupina 4'!CR12","v":"Tomaž BENEDIČIČ"},{"$f":"'Skupina 4'!CS12","v":1},{"$f":"'Skupina 4'!CT12","v":5},{"$f":"'Skupina 4'!CU12","v":"W"},{"$f":"'Skupina 4'!CV12","v":"F"},{"$f":"'Skupina 4'!CW12","v":true}]
[{"$f":"'Skupina 4'!CE13","v":"4"},{"$f":"'Skupina 4'!CF13","v":12},{"$f":"'Skupina 4'!CG13","v":""},{"$f":"'Skupina 4'!CH13","v":"09:00:00"},{"$f":"'Skupina 4'!CI13","v":0},{"$f":"'Skupina 4'!CJ13","v":""},{"$f":"'Skupina 4'!CK13","v":"00:00:00"},{"$f":"'Skupina 4'!CL13","v":"00:00:00"},{"$f":"'Skupina 4'!CM13","v":""},{"$f":"'Skupina 4'!CN13","v":""},{"$f":"'Skupina 4'!CO13","v":0},{"$f":"'Skupina 4'!CP13","v":0},{"$f":"'Skupina 4'!CQ13","v":0},{"$f":"'Skupina 4'!CR13","v":"Sašo MEŽEK"},{"$f":"'Skupina 4'!CS13","v":689},{"$f":"'Skupina 4'!CT13","v":0},{"$f":"'Skupina 4'!CU13","v":0},{"$f":"'Skupina 4'!CV13","v":0},{"$f":"'Skupina 4'!CW13","v":false}]
[{"$f":"'Skupina 4'!CE14","v":"4"},{"$f":"'Skupina 4'!CF14","v":13},{"$f":"'Skupina 4'!CG14","v":"7"},{"$f":"'Skupina 4'!CH14","v":"09:00:00"},{"$f":"'Skupina 4'!CI14","v":5},{"$f":"'Skupina 4'!CJ14","v":""},{"$f":"'Skupina 4'!CK14","v":"09:17:00"},{"$f":"'Skupina 4'!CL14","v":"10:44:00"},{"$f":"'Skupina 4'!CM14","v":"01:27:00"},{"$f":"'Skupina 4'!CN14","v":"Franci ČUČNIK"},{"$f":"'Skupina 4'!CO14","v":891},{"$f":"'Skupina 4'!CP14","v":3},{"$f":"'Skupina 4'!CQ14","v":"L"},{"$f":"'Skupina 4'!CR14","v":"Nino PORIČ"},{"$f":"'Skupina 4'!CS14","v":866},{"$f":"'Skupina 4'!CT14","v":5},{"$f":"'Skupina 4'!CU14","v":"W"},{"$f":"'Skupina 4'!CV14","v":"F"},{"$f":"'Skupina 4'!CW14","v":true}]
[{"$f":"'Skupina 4'!CE15","v":"4"},{"$f":"'Skupina 4'!CF15","v":14},{"$f":"'Skupina 4'!CG15","v":""},{"$f":"'Skupina 4'!CH15","v":"09:00:00"},{"$f":"'Skupina 4'!CI15","v":0},{"$f":"'Skupina 4'!CJ15","v":""},{"$f":"'Skupina 4'!CK15","v":"00:00:00"},{"$f":"'Skupina 4'!CL15","v":"00:00:00"},{"$f":"'Skupina 4'!CM15","v":""},{"$f":"'Skupina 4'!CN15","v":""},{"$f":"'Skupina 4'!CO15","v":0},{"$f":"'Skupina 4'!CP15","v":0},{"$f":"'Skupina 4'!CQ15","v":0},{"$f":"'Skupina 4'!CR15","v":""},{"$f":"'Skupina 4'!CS15","v":0},{"$f":"'Skupina 4'!CT15","v":0},{"$f":"'Skupina 4'!CU15","v":0},{"$f":"'Skupina 4'!CV15","v":0},{"$f":"'Skupina 4'!CW15","v":false}]
[{"$f":"'Skupina 4'!CE16","v":"4"},{"$f":"'Skupina 4'!CF16","v":15},{"$f":"'Skupina 4'!CG16","v":""},{"$f":"'Skupina 4'!CH16","v":"09:00:00"},{"$f":"'Skupina 4'!CI16","v":0},{"$f":"'Skupina 4'!CJ16","v":""},{"$f":"'Skupina 4'!CK16","v":"00:00:00"},{"$f":"'Skupina 4'!CL16","v":"00:00:00"},{"$f":"'Skupina 4'!CM16","v":""},{"$f":"'Skupina 4'!CN16","v":""},{"$f":"'Skupina 4'!CO16","v":0},{"$f":"'Skupina 4'!CP16","v":0},{"$f":"'Skupina 4'!CQ16","v":0},{"$f":"'Skupina 4'!CR16","v":"Lovro KOKOT"},{"$f":"'Skupina 4'!CS16","v":915},{"$f":"'Skupina 4'!CT16","v":0},{"$f":"'Skupina 4'!CU16","v":0},{"$f":"'Skupina 4'!CV16","v":0},{"$f":"'Skupina 4'!CW16","v":false}]
[{"$f":"'Skupina 4'!CE17","v":"4"},{"$f":"'Skupina 4'!CF17","v":16},{"$f":"'Skupina 4'!CG17","v":""},{"$f":"'Skupina 4'!CH17","v":"09:00:00"},{"$f":"'Skupina 4'!CI17","v":5},{"$f":"'Skupina 4'!CJ17","v":""},{"$f":"'Skupina 4'!CK17","v":"10:22:00"},{"$f":"'Skupina 4'!CL17","v":"10:23:00"},{"$f":"'Skupina 4'!CM17","v":"00:01:00"},{"$f":"'Skupina 4'!CN17","v":"Sašo MEŽEK"},{"$f":"'Skupina 4'!CO17","v":689},{"$f":"'Skupina 4'!CP17","v":0},{"$f":"'Skupina 4'!CQ17","v":"DNS"},{"$f":"'Skupina 4'!CR17","v":"Tomaž BENEDIČIČ"},{"$f":"'Skupina 4'!CS17","v":1},{"$f":"'Skupina 4'!CT17","v":0},{"$f":"'Skupina 4'!CU17","v":"WO"},{"$f":"'Skupina 4'!CV17","v":"F"},{"$f":"'Skupina 4'!CW17","v":true}]
[{"$f":"'Skupina 4'!CE18","v":"4"},{"$f":"'Skupina 4'!CF18","v":17},{"$f":"'Skupina 4'!CG18","v":"8"},{"$f":"'Skupina 4'!CH18","v":"09:00:00"},{"$f":"'Skupina 4'!CI18","v":5},{"$f":"'Skupina 4'!CJ18","v":""},{"$f":"'Skupina 4'!CK18","v":"10:49:00"},{"$f":"'Skupina 4'!CL18","v":"11:30:00"},{"$f":"'Skupina 4'!CM18","v":"00:41:00"},{"$f":"'Skupina 4'!CN18","v":"Lovro KOKOT"},{"$f":"'Skupina 4'!CO18","v":915},{"$f":"'Skupina 4'!CP18","v":0},{"$f":"'Skupina 4'!CQ18","v":"L"},{"$f":"'Skupina 4'!CR18","v":"Franci ČUČNIK"},{"$f":"'Skupina 4'!CS18","v":891},{"$f":"'Skupina 4'!CT18","v":5},{"$f":"'Skupina 4'!CU18","v":"W"},{"$f":"'Skupina 4'!CV18","v":"F"},{"$f":"'Skupina 4'!CW18","v":true}]
[{"$f":"'Skupina 4'!CE19","v":"4"},{"$f":"'Skupina 4'!CF19","v":18},{"$f":"'Skupina 4'!CG19","v":""},{"$f":"'Skupina 4'!CH19","v":"09:00:00"},{"$f":"'Skupina 4'!CI19","v":0},{"$f":"'Skupina 4'!CJ19","v":""},{"$f":"'Skupina 4'!CK19","v":"00:00:00"},{"$f":"'Skupina 4'!CL19","v":"00:00:00"},{"$f":"'Skupina 4'!CM19","v":""},{"$f":"'Skupina 4'!CN19","v":"Nino PORIČ"},{"$f":"'Skupina 4'!CO19","v":866},{"$f":"'Skupina 4'!CP19","v":0},{"$f":"'Skupina 4'!CQ19","v":0},{"$f":"'Skupina 4'!CR19","v":""},{"$f":"'Skupina 4'!CS19","v":0},{"$f":"'Skupina 4'!CT19","v":0},{"$f":"'Skupina 4'!CU19","v":0},{"$f":"'Skupina 4'!CV19","v":0},{"$f":"'Skupina 4'!CW19","v":false}]
[{"$f":"'Skupina 4'!CE20","v":"4"},{"$f":"'Skupina 4'!CF20","v":19},{"$f":"'Skupina 4'!CG20","v":""},{"$f":"'Skupina 4'!CH20","v":"09:00:00"},{"$f":"'Skupina 4'!CI20","v":0},{"$f":"'Skupina 4'!CJ20","v":""},{"$f":"'Skupina 4'!CK20","v":"00:00:00"},{"$f":"'Skupina 4'!CL20","v":"00:00:00"},{"$f":"'Skupina 4'!CM20","v":""},{"$f":"'Skupina 4'!CN20","v":"Tomaž BENEDIČIČ"},{"$f":"'Skupina 4'!CO20","v":1},{"$f":"'Skupina 4'!CP20","v":0},{"$f":"'Skupina 4'!CQ20","v":0},{"$f":"'Skupina 4'!CR20","v":""},{"$f":"'Skupina 4'!CS20","v":0},{"$f":"'Skupina 4'!CT20","v":0},{"$f":"'Skupina 4'!CU20","v":0},{"$f":"'Skupina 4'!CV20","v":0},{"$f":"'Skupina 4'!CW20","v":false}]
[{"$f":"'Skupina 4'!CE21","v":"4"},{"$f":"'Skupina 4'!CF21","v":20},{"$f":"'Skupina 4'!CG21","v":""},{"$f":"'Skupina 4'!CH21","v":"09:00:00"},{"$f":"'Skupina 4'!CI21","v":0},{"$f":"'Skupina 4'!CJ21","v":""},{"$f":"'Skupina 4'!CK21","v":"00:00:00"},{"$f":"'Skupina 4'!CL21","v":"00:00:00"},{"$f":"'Skupina 4'!CM21","v":""},{"$f":"'Skupina 4'!CN21","v":""},{"$f":"'Skupina 4'!CO21","v":0},{"$f":"'Skupina 4'!CP21","v":0},{"$f":"'Skupina 4'!CQ21","v":0},{"$f":"'Skupina 4'!CR21","v":"Sašo MEŽEK"},{"$f":"'Skupina 4'!CS21","v":689},{"$f":"'Skupina 4'!CT21","v":0},{"$f":"'Skupina 4'!CU21","v":0},{"$f":"'Skupina 4'!CV21","v":0},{"$f":"'Skupina 4'!CW21","v":false}]
[{"$f":"'Skupina 4'!CE22","v":"4"},{"$f":"'Skupina 4'!CF22","v":21},{"$f":"'Skupina 4'!CG22","v":"8"},{"$f":"'Skupina 4'!CH22","v":"09:00:00"},{"$f":"'Skupina 4'!CI22","v":5},{"$f":"'Skupina 4'!CJ22","v":""},{"$f":"'Skupina 4'!CK22","v":"11:32:00"},{"$f":"'Skupina 4'!CL22","v":"12:29:00"},{"$f":"'Skupina 4'!CM22","v":"00:57:00"},{"$f":"'Skupina 4'!CN22","v":"Franci ČUČNIK"},{"$f":"'Skupina 4'!CO22","v":891},{"$f":"'Skupina 4'!CP22","v":5},{"$f":"'Skupina 4'!CQ22","v":"W"},{"$f":"'Skupina 4'!CR22","v":"Tomaž BENEDIČIČ"},{"$f":"'Skupina 4'!CS22","v":1},{"$f":"'Skupina 4'!CT22","v":0},{"$f":"'Skupina 4'!CU22","v":"L"},{"$f":"'Skupina 4'!CV22","v":"F"},{"$f":"'Skupina 4'!CW22","v":true}]
[{"$f":"'Skupina 4'!CE23","v":"4"},{"$f":"'Skupina 4'!CF23","v":22},{"$f":"'Skupina 4'!CG23","v":""},{"$f":"'Skupina 4'!CH23","v":"09:00:00"},{"$f":"'Skupina 4'!CI23","v":0},{"$f":"'Skupina 4'!CJ23","v":""},{"$f":"'Skupina 4'!CK23","v":"00:00:00"},{"$f":"'Skupina 4'!CL23","v":"00:00:00"},{"$f":"'Skupina 4'!CM23","v":""},{"$f":"'Skupina 4'!CN23","v":""},{"$f":"'Skupina 4'!CO23","v":0},{"$f":"'Skupina 4'!CP23","v":0},{"$f":"'Skupina 4'!CQ23","v":0},{"$f":"'Skupina 4'!CR23","v":"Lovro KOKOT"},{"$f":"'Skupina 4'!CS23","v":915},{"$f":"'Skupina 4'!CT23","v":0},{"$f":"'Skupina 4'!CU23","v":0},{"$f":"'Skupina 4'!CV23","v":0},{"$f":"'Skupina 4'!CW23","v":false}]
[{"$f":"'Skupina 4'!CE24","v":"4"},{"$f":"'Skupina 4'!CF24","v":23},{"$f":"'Skupina 4'!CG24","v":""},{"$f":"'Skupina 4'!CH24","v":"09:00:00"},{"$f":"'Skupina 4'!CI24","v":0},{"$f":"'Skupina 4'!CJ24","v":""},{"$f":"'Skupina 4'!CK24","v":"00:00:00"},{"$f":"'Skupina 4'!CL24","v":"00:00:00"},{"$f":"'Skupina 4'!CM24","v":""},{"$f":"'Skupina 4'!CN24","v":""},{"$f":"'Skupina 4'!CO24","v":0},{"$f":"'Skupina 4'!CP24","v":0},{"$f":"'Skupina 4'!CQ24","v":0},{"$f":"'Skupina 4'!CR24","v":"Nino PORIČ"},{"$f":"'Skupina 4'!CS24","v":866},{"$f":"'Skupina 4'!CT24","v":0},{"$f":"'Skupina 4'!CU24","v":0},{"$f":"'Skupina 4'!CV24","v":0},{"$f":"'Skupina 4'!CW24","v":false}]
[{"$f":"'Skupina 4'!CE25","v":"4"},{"$f":"'Skupina 4'!CF25","v":24},{"$f":"'Skupina 4'!CG25","v":""},{"$f":"'Skupina 4'!CH25","v":"09:00:00"},{"$f":"'Skupina 4'!CI25","v":0},{"$f":"'Skupina 4'!CJ25","v":""},{"$f":"'Skupina 4'!CK25","v":"00:00:00"},{"$f":"'Skupina 4'!CL25","v":"00:00:00"},{"$f":"'Skupina 4'!CM25","v":""},{"$f":"'Skupina 4'!CN25","v":"Sašo MEŽEK"},{"$f":"'Skupina 4'!CO25","v":689},{"$f":"'Skupina 4'!CP25","v":0},{"$f":"'Skupina 4'!CQ25","v":0},{"$f":"'Skupina 4'!CR25","v":""},{"$f":"'Skupina 4'!CS25","v":0},{"$f":"'Skupina 4'!CT25","v":0},{"$f":"'Skupina 4'!CU25","v":0},{"$f":"'Skupina 4'!CV25","v":0},{"$f":"'Skupina 4'!CW25","v":false}]
[{"$f":"'Skupina 4'!CE26","v":"4"},{"$f":"'Skupina 4'!CF26","v":25},{"$f":"'Skupina 4'!CG26","v":""},{"$f":"'Skupina 4'!CH26","v":"09:00:00"},{"$f":"'Skupina 4'!CI26","v":0},{"$f":"'Skupina 4'!CJ26","v":""},{"$f":"'Skupina 4'!CK26","v":"00:00:00"},{"$f":"'Skupina 4'!CL26","v":"00:00:00"},{"$f":"'Skupina 4'!CM26","v":""},{"$f":"'Skupina 4'!CN26","v":""},{"$f":"'Skupina 4'!CO26","v":0},{"$f":"'Skupina 4'!CP26","v":0},{"$f":"'Skupina 4'!CQ26","v":0},{"$f":"'Skupina 4'!CR26","v":"Franci ČUČNIK"},{"$f":"'Skupina 4'!CS26","v":891},{"$f":"'Skupina 4'!CT26","v":0},{"$f":"'Skupina 4'!CU26","v":0},{"$f":"'Skupina 4'!CV26","v":0},{"$f":"'Skupina 4'!CW26","v":false}]
[{"$f":"'Skupina 4'!CE27","v":"4"},{"$f":"'Skupina 4'!CF27","v":26},{"$f":"'Skupina 4'!CG27","v":""},{"$f":"'Skupina 4'!CH27","v":"09:00:00"},{"$f":"'Skupina 4'!CI27","v":0},{"$f":"'Skupina 4'!CJ27","v":""},{"$f":"'Skupina 4'!CK27","v":"00:00:00"},{"$f":"'Skupina 4'!CL27","v":"00:00:00"},{"$f":"'Skupina 4'!CM27","v":""},{"$f":"'Skupina 4'!CN27","v":"Tomaž BENEDIČIČ"},{"$f":"'Skupina 4'!CO27","v":1},{"$f":"'Skupina 4'!CP27","v":0},{"$f":"'Skupina 4'!CQ27","v":0},{"$f":"'Skupina 4'!CR27","v":""},{"$f":"'Skupina 4'!CS27","v":0},{"$f":"'Skupina 4'!CT27","v":0},{"$f":"'Skupina 4'!CU27","v":0},{"$f":"'Skupina 4'!CV27","v":0},{"$f":"'Skupina 4'!CW27","v":false}]
[{"$f":"'Skupina 4'!CE28","v":"4"},{"$f":"'Skupina 4'!CF28","v":27},{"$f":"'Skupina 4'!CG28","v":""},{"$f":"'Skupina 4'!CH28","v":"09:00:00"},{"$f":"'Skupina 4'!CI28","v":0},{"$f":"'Skupina 4'!CJ28","v":""},{"$f":"'Skupina 4'!CK28","v":"00:00:00"},{"$f":"'Skupina 4'!CL28","v":"00:00:00"},{"$f":"'Skupina 4'!CM28","v":""},{"$f":"'Skupina 4'!CN28","v":"Lovro KOKOT"},{"$f":"'Skupina 4'!CO28","v":915},{"$f":"'Skupina 4'!CP28","v":0},{"$f":"'Skupina 4'!CQ28","v":0},{"$f":"'Skupina 4'!CR28","v":""},{"$f":"'Skupina 4'!CS28","v":0},{"$f":"'Skupina 4'!CT28","v":0},{"$f":"'Skupina 4'!CU28","v":0},{"$f":"'Skupina 4'!CV28","v":0},{"$f":"'Skupina 4'!CW28","v":false}]
[{"$f":"'Skupina 4'!CE29","v":"4"},{"$f":"'Skupina 4'!CF29","v":28},{"$f":"'Skupina 4'!CG29","v":""},{"$f":"'Skupina 4'!CH29","v":"09:00:00"},{"$f":"'Skupina 4'!CI29","v":5},{"$f":"'Skupina 4'!CJ29","v":""},{"$f":"'Skupina 4'!CK29","v":"10:22:00"},{"$f":"'Skupina 4'!CL29","v":"10:23:00"},{"$f":"'Skupina 4'!CM29","v":"00:01:00"},{"$f":"'Skupina 4'!CN29","v":"Nino PORIČ"},{"$f":"'Skupina 4'!CO29","v":866},{"$f":"'Skupina 4'!CP29","v":0},{"$f":"'Skupina 4'!CQ29","v":"WO"},{"$f":"'Skupina 4'!CR29","v":"Sašo MEŽEK"},{"$f":"'Skupina 4'!CS29","v":689},{"$f":"'Skupina 4'!CT29","v":0},{"$f":"'Skupina 4'!CU29","v":"DNS"},{"$f":"'Skupina 4'!CV29","v":"F"},{"$f":"'Skupina 4'!CW29","v":true}]
[{"$f":"'Finalna skupina'!BE2","v":"F"},{"$f":"'Finalna skupina'!BF2","v":1},{"$f":"'Finalna skupina'!BG2","v":"1"},{"$f":"'Finalna skupina'!BH2","v":"00:00:00"},{"$f":"'Finalna skupina'!BI2","v":7},{"$f":"'Finalna skupina'!BJ2","v":""},{"$f":"'Finalna skupina'!BK2","v":"16:00:00"},{"$f":"'Finalna skupina'!BL2","v":"17:05:00"},{"$f":"'Finalna skupina'!BM2","v":"01:05:00"},{"$f":"'Finalna skupina'!BN2","v":"Mitja GRADIŠNIK"},{"$f":"'Finalna skupina'!BO2","v":92},{"$f":"'Finalna skupina'!BP2","v":7},{"$f":"'Finalna skupina'!BQ2","v":"W"},{"$f":"'Finalna skupina'!BR2","v":"Aleksander RAIŠIČ"},{"$f":"'Finalna skupina'!BS2","v":220},{"$f":"'Finalna skupina'!BT2","v":3},{"$f":"'Finalna skupina'!BU2","v":"L"},{"$f":"'Finalna skupina'!BV2","v":"F"},{"$f":"'Finalna skupina'!BW2","v":false}]
[{"$f":"'Finalna skupina'!BE3","v":"F"},{"$f":"'Finalna skupina'!BF3","v":2},{"$f":"'Finalna skupina'!BG3","v":"2"},{"$f":"'Finalna skupina'!BH3","v":"00:00:00"},{"$f":"'Finalna skupina'!BI3","v":7},{"$f":"'Finalna skupina'!BJ3","v":""},{"$f":"'Finalna skupina'!BK3","v":"16:00:00"},{"$f":"'Finalna skupina'!BL3","v":"17:17:00"},{"$f":"'Finalna skupina'!BM3","v":"01:17:00"},{"$f":"'Finalna skupina'!BN3","v":"Ana GRADIŠNIK"},{"$f":"'Finalna skupina'!BO3","v":551},{"$f":"'Finalna skupina'!BP3","v":7},{"$f":"'Finalna skupina'!BQ3","v":"W"},{"$f":"'Finalna skupina'!BR3","v":"Damjan KEREP"},{"$f":"'Finalna skupina'!BS3","v":300},{"$f":"'Finalna skupina'!BT3","v":1},{"$f":"'Finalna skupina'!BU3","v":"L"},{"$f":"'Finalna skupina'!BV3","v":"F"},{"$f":"'Finalna skupina'!BW3","v":false}]
[{"$f":"'Finalna skupina'!BE4","v":"F"},{"$f":"'Finalna skupina'!BF4","v":3},{"$f":"'Finalna skupina'!BG4","v":"3"},{"$f":"'Finalna skupina'!BH4","v":"00:00:00"},{"$f":"'Finalna skupina'!BI4","v":7},{"$f":"'Finalna skupina'!BJ4","v":""},{"$f":"'Finalna skupina'!BK4","v":"16:00:00"},{"$f":"'Finalna skupina'!BL4","v":"18:06:00"},{"$f":"'Finalna skupina'!BM4","v":"02:06:00"},{"$f":"'Finalna skupina'!BN4","v":"Denis GODEŠA"},{"$f":"'Finalna skupina'!BO4","v":723},{"$f":"'Finalna skupina'!BP4","v":7},{"$f":"'Finalna skupina'!BQ4","v":"W"},{"$f":"'Finalna skupina'!BR4","v":"Franci ČUČNIK"},{"$f":"'Finalna skupina'!BS4","v":891},{"$f":"'Finalna skupina'!BT4","v":5},{"$f":"'Finalna skupina'!BU4","v":"L"},{"$f":"'Finalna skupina'!BV4","v":"F"},{"$f":"'Finalna skupina'!BW4","v":false}]
[{"$f":"'Finalna skupina'!BE5","v":"F"},{"$f":"'Finalna skupina'!BF5","v":4},{"$f":"'Finalna skupina'!BG5","v":"4"},{"$f":"'Finalna skupina'!BH5","v":"00:00:00"},{"$f":"'Finalna skupina'!BI5","v":7},{"$f":"'Finalna skupina'!BJ5","v":""},{"$f":"'Finalna skupina'!BK5","v":"16:00:00"},{"$f":"'Finalna skupina'!BL5","v":"17:28:00"},{"$f":"'Finalna skupina'!BM5","v":"01:28:00"},{"$f":"'Finalna skupina'!BN5","v":"Igor BAJSIČ"},{"$f":"'Finalna skupina'!BO5","v":799},{"$f":"'Finalna skupina'!BP5","v":5},{"$f":"'Finalna skupina'!BQ5","v":"L"},{"$f":"'Finalna skupina'!BR5","v":"Klemen GRADIŠNIK"},{"$f":"'Finalna skupina'!BS5","v":612},{"$f":"'Finalna skupina'!BT5","v":7},{"$f":"'Finalna skupina'!BU5","v":"W"},{"$f":"'Finalna skupina'!BV5","v":"F"},{"$f":"'Finalna skupina'!BW5","v":false}]
[{"$f":"'Finalna skupina'!BE6","v":"F"},{"$f":"'Finalna skupina'!BF6","v":5},{"$f":"'Finalna skupina'!BG6","v":"5"},{"$f":"'Finalna skupina'!BH6","v":"00:00:00"},{"$f":"'Finalna skupina'!BI6","v":7},{"$f":"'Finalna skupina'!BJ6","v":""},{"$f":"'Finalna skupina'!BK6","v":"16:00:00"},{"$f":"'Finalna skupina'!BL6","v":"17:03:00"},{"$f":"'Finalna skupina'!BM6","v":"01:03:00"},{"$f":"'Finalna skupina'!BN6","v":"Matjaž ERČULJ"},{"$f":"'Finalna skupina'!BO6","v":80},{"$f":"'Finalna skupina'!BP6","v":7},{"$f":"'Finalna skupina'!BQ6","v":"W"},{"$f":"'Finalna skupina'!BR6","v":"Kristijan HAMZOVSKI"},{"$f":"'Finalna skupina'!BS6","v":774},{"$f":"'Finalna skupina'!BT6","v":3},{"$f":"'Finalna skupina'!BU6","v":"L"},{"$f":"'Finalna skupina'!BV6","v":"F"},{"$f":"'Finalna skupina'!BW6","v":false}]
[{"$f":"'Finalna skupina'!BE7","v":"F"},{"$f":"'Finalna skupina'!BF7","v":6},{"$f":"'Finalna skupina'!BG7","v":"6"},{"$f":"'Finalna skupina'!BH7","v":"00:00:00"},{"$f":"'Finalna skupina'!BI7","v":7},{"$f":"'Finalna skupina'!BJ7","v":""},{"$f":"'Finalna skupina'!BK7","v":"16:00:00"},{"$f":"'Finalna skupina'!BL7","v":"17:48:00"},{"$f":"'Finalna skupina'!BM7","v":"01:48:00"},{"$f":"'Finalna skupina'!BN7","v":"Matej BRAJKOVIČ"},{"$f":"'Finalna skupina'!BO7","v":440},{"$f":"'Finalna skupina'!BP7","v":6},{"$f":"'Finalna skupina'!BQ7","v":"L"},{"$f":"'Finalna skupina'!BR7","v":"Miha ZAJC"},{"$f":"'Finalna skupina'!BS7","v":589},{"$f":"'Finalna skupina'!BT7","v":7},{"$f":"'Finalna skupina'!BU7","v":"W"},{"$f":"'Finalna skupina'!BV7","v":"F"},{"$f":"'Finalna skupina'!BW7","v":false}]
[{"$f":"'Finalna skupina'!BE8","v":"F"},{"$f":"'Finalna skupina'!BF8","v":7},{"$f":"'Finalna skupina'!BG8","v":"7"},{"$f":"'Finalna skupina'!BH8","v":"00:00:00"},{"$f":"'Finalna skupina'!BI8","v":7},{"$f":"'Finalna skupina'!BJ8","v":""},{"$f":"'Finalna skupina'!BK8","v":"16:00:00"},{"$f":"'Finalna skupina'!BL8","v":"16:56:00"},{"$f":"'Finalna skupina'!BM8","v":"00:56:00"},{"$f":"'Finalna skupina'!BN8","v":"Miha ŽAGAR"},{"$f":"'Finalna skupina'!BO8","v":2},{"$f":"'Finalna skupina'!BP8","v":2},{"$f":"'Finalna skupina'!BQ8","v":"L"},{"$f":"'Finalna skupina'!BR8","v":"Nino PORIČ"},{"$f":"'Finalna skupina'!BS8","v":866},{"$f":"'Finalna skupina'!BT8","v":7},{"$f":"'Finalna skupina'!BU8","v":"W"},{"$f":"'Finalna skupina'!BV8","v":"F"},{"$f":"'Finalna skupina'!BW8","v":false}]
[{"$f":"'Finalna skupina'!BE9","v":"F"},{"$f":"'Finalna skupina'!BF9","v":8},{"$f":"'Finalna skupina'!BG9","v":""},{"$f":"'Finalna skupina'!BH9","v":"00:00:00"},{"$f":"'Finalna skupina'!BI9","v":7},{"$f":"'Finalna skupina'!BJ9","v":""},{"$f":"'Finalna skupina'!BK9","v":"16:00:00"},{"$f":"'Finalna skupina'!BL9","v":"17:30:00"},{"$f":"'Finalna skupina'!BM9","v":"01:30:00"},{"$f":"'Finalna skupina'!BN9","v":"Robert REDNAK"},{"$f":"'Finalna skupina'!BO9","v":178},{"$f":"'Finalna skupina'!BP9","v":3},{"$f":"'Finalna skupina'!BQ9","v":"L"},{"$f":"'Finalna skupina'!BR9","v":"Jurij POTOČNIK"},{"$f":"'Finalna skupina'!BS9","v":487},{"$f":"'Finalna skupina'!BT9","v":7},{"$f":"'Finalna skupina'!BU9","v":"W"},{"$f":"'Finalna skupina'!BV9","v":"F"},{"$f":"'Finalna skupina'!BW9","v":false}]
[{"$f":"'Finalna skupina'!BE10","v":"F"},{"$f":"'Finalna skupina'!BF10","v":9},{"$f":"'Finalna skupina'!BG10","v":"5"},{"$f":"'Finalna skupina'!BH10","v":"00:00:00"},{"$f":"'Finalna skupina'!BI10","v":7},{"$f":"'Finalna skupina'!BJ10","v":""},{"$f":"'Finalna skupina'!BK10","v":"17:28:00"},{"$f":"'Finalna skupina'!BL10","v":"18:28:00"},{"$f":"'Finalna skupina'!BM10","v":"01:00:00"},{"$f":"'Finalna skupina'!BN10","v":"Mitja GRADIŠNIK"},{"$f":"'Finalna skupina'!BO10","v":92},{"$f":"'Finalna skupina'!BP10","v":7},{"$f":"'Finalna skupina'!BQ10","v":"W"},{"$f":"'Finalna skupina'!BR10","v":"Ana GRADIŠNIK"},{"$f":"'Finalna skupina'!BS10","v":551},{"$f":"'Finalna skupina'!BT10","v":4},{"$f":"'Finalna skupina'!BU10","v":"L"},{"$f":"'Finalna skupina'!BV10","v":"F"},{"$f":"'Finalna skupina'!BW10","v":false}]
[{"$f":"'Finalna skupina'!BE11","v":"F"},{"$f":"'Finalna skupina'!BF11","v":10},{"$f":"'Finalna skupina'!BG11","v":"4"},{"$f":"'Finalna skupina'!BH11","v":"00:00:00"},{"$f":"'Finalna skupina'!BI11","v":7},{"$f":"'Finalna skupina'!BJ11","v":""},{"$f":"'Finalna skupina'!BK11","v":"18:06:00"},{"$f":"'Finalna skupina'!BL11","v":"19:55:00"},{"$f":"'Finalna skupina'!BM11","v":"01:49:00"},{"$f":"'Finalna skupina'!BN11","v":"Denis GODEŠA"},{"$f":"'Finalna skupina'!BO11","v":723},{"$f":"'Finalna skupina'!BP11","v":7},{"$f":"'Finalna skupina'!BQ11","v":"W"},{"$f":"'Finalna skupina'!BR11","v":"Klemen GRADIŠNIK"},{"$f":"'Finalna skupina'!BS11","v":612},{"$f":"'Finalna skupina'!BT11","v":6},{"$f":"'Finalna skupina'!BU11","v":"L"},{"$f":"'Finalna skupina'!BV11","v":"F"},{"$f":"'Finalna skupina'!BW11","v":false}]
[{"$f":"'Finalna skupina'!BE12","v":"F"},{"$f":"'Finalna skupina'!BF12","v":11},{"$f":"'Finalna skupina'!BG12","v":"6"},{"$f":"'Finalna skupina'!BH12","v":"00:00:00"},{"$f":"'Finalna skupina'!BI12","v":7},{"$f":"'Finalna skupina'!BJ12","v":""},{"$f":"'Finalna skupina'!BK12","v":"17:49:00"},{"$f":"'Finalna skupina'!BL12","v":"18:52:00"},{"$f":"'Finalna skupina'!BM12","v":"01:03:00"},{"$f":"'Finalna skupina'!BN12","v":"Matjaž ERČULJ"},{"$f":"'Finalna skupina'!BO12","v":80},{"$f":"'Finalna skupina'!BP12","v":7},{"$f":"'Finalna skupina'!BQ12","v":"W"},{"$f":"'Finalna skupina'!BR12","v":"Miha ZAJC"},{"$f":"'Finalna skupina'!BS12","v":589},{"$f":"'Finalna skupina'!BT12","v":4},{"$f":"'Finalna skupina'!BU12","v":"L"},{"$f":"'Finalna skupina'!BV12","v":"F"},{"$f":"'Finalna skupina'!BW12","v":false}]
[{"$f":"'Finalna skupina'!BE13","v":"F"},{"$f":"'Finalna skupina'!BF13","v":12},{"$f":"'Finalna skupina'!BG13","v":""},{"$f":"'Finalna skupina'!BH13","v":"00:00:00"},{"$f":"'Finalna skupina'!BI13","v":7},{"$f":"'Finalna skupina'!BJ13","v":""},{"$f":"'Finalna skupina'!BK13","v":"17:31:00"},{"$f":"'Finalna skupina'!BL13","v":"18:30:00"},{"$f":"'Finalna skupina'!BM13","v":"00:59:00"},{"$f":"'Finalna skupina'!BN13","v":"Nino PORIČ"},{"$f":"'Finalna skupina'!BO13","v":866},{"$f":"'Finalna skupina'!BP13","v":7},{"$f":"'Finalna skupina'!BQ13","v":"W"},{"$f":"'Finalna skupina'!BR13","v":"Jurij POTOČNIK"},{"$f":"'Finalna skupina'!BS13","v":487},{"$f":"'Finalna skupina'!BT13","v":2},{"$f":"'Finalna skupina'!BU13","v":"L"},{"$f":"'Finalna skupina'!BV13","v":"F"},{"$f":"'Finalna skupina'!BW13","v":false}]
[{"$f":"'Finalna skupina'!BE14","v":"F"},{"$f":"'Finalna skupina'!BF14","v":13},{"$f":"'Finalna skupina'!BG14","v":"5"},{"$f":"'Finalna skupina'!BH14","v":"00:00:00"},{"$f":"'Finalna skupina'!BI14","v":7},{"$f":"'Finalna skupina'!BJ14","v":""},{"$f":"'Finalna skupina'!BK14","v":"19:56:00"},{"$f":"'Finalna skupina'!BL14","v":"21:23:00"},{"$f":"'Finalna skupina'!BM14","v":"01:27:00"},{"$f":"'Finalna skupina'!BN14","v":"Mitja GRADIŠNIK"},{"$f":"'Finalna skupina'!BO14","v":92},{"$f":"'Finalna skupina'!BP14","v":5},{"$f":"'Finalna skupina'!BQ14","v":"l"},{"$f":"'Finalna skupina'!BR14","v":"Denis GODEŠA"},{"$f":"'Finalna skupina'!BS14","v":723},{"$f":"'Finalna skupina'!BT14","v":7},{"$f":"'Finalna skupina'!BU14","v":"w"},{"$f":"'Finalna skupina'!BV14","v":"F"},{"$f":"'Finalna skupina'!BW14","v":false}]
[{"$f":"'Finalna skupina'!BE15","v":"F"},{"$f":"'Finalna skupina'!BF15","v":14},{"$f":"'Finalna skupina'!BG15","v":"6"},{"$f":"'Finalna skupina'!BH15","v":"00:00:00"},{"$f":"'Finalna skupina'!BI15","v":7},{"$f":"'Finalna skupina'!BJ15","v":""},{"$f":"'Finalna skupina'!BK15","v":"19:56:00"},{"$f":"'Finalna skupina'!BL15","v":"20:52:00"},{"$f":"'Finalna skupina'!BM15","v":"00:56:00"},{"$f":"'Finalna skupina'!BN15","v":"Matjaž ERČULJ"},{"$f":"'Finalna skupina'!BO15","v":80},{"$f":"'Finalna skupina'!BP15","v":7},{"$f":"'Finalna skupina'!BQ15","v":"W"},{"$f":"'Finalna skupina'!BR15","v":"Nino PORIČ"},{"$f":"'Finalna skupina'!BS15","v":866},{"$f":"'Finalna skupina'!BT15","v":4},{"$f":"'Finalna skupina'!BU15","v":"L"},{"$f":"'Finalna skupina'!BV15","v":"F"},{"$f":"'Finalna skupina'!BW15","v":false}]
[{"$f":"'Finalna skupina'!BE16","v":"F"},{"$f":"'Finalna skupina'!BF16","v":15},{"$f":"'Finalna skupina'!BG16","v":"6"},{"$f":"'Finalna skupina'!BH16","v":"00:00:00"},{"$f":"'Finalna skupina'!BI16","v":7},{"$f":"'Finalna skupina'!BJ16","v":""},{"$f":"'Finalna skupina'!BK16","v":"21:27:00"},{"$f":"'Finalna skupina'!BL16","v":"22:13:00"},{"$f":"'Finalna skupina'!BM16","v":"00:46:00"},{"$f":"'Finalna skupina'!BN16","v":"Denis GODEŠA"},{"$f":"'Finalna skupina'!BO16","v":723},{"$f":"'Finalna skupina'!BP16","v":2},{"$f":"'Finalna skupina'!BQ16","v":"L"},{"$f":"'Finalna skupina'!BR16","v":"Matjaž ERČULJ"},{"$f":"'Finalna skupina'!BS16","v":80},{"$f":"'Finalna skupina'!BT16","v":7},{"$f":"'Finalna skupina'!BU16","v":"W"},{"$f":"'Finalna skupina'!BV16","v":"F"},{"$f":"'Finalna skupina'!BW16","v":false}]

{"sheet":"Configuration","index":10,"n_rows":20,"n_cols":4,"rows_kept":20,"cut":false,"hidden":true,"merged":[]}
["TournamentSize",40]
["TournamentGroupCount",4]
["TournamentGroupSize",8]
["TournamentFinalSize",16]
["TournamentFinalPreQualified",8]
["TournamentQualificationSize",{"$f":"TournamentSize-TournamentFinalPreQualified","v":32}]
["FinishedMatchStates",{"$f":"CodeLists!$G$4","v":"F"}]
["AnnouncedMatchStates","A"]
["InProgressMatchStates","P"]
["WinStates","W","WO"]
["LoseStates","L","FF","DNS"]
["DisqualifiedStates","DQ"]
["BlankMatchCompetitorText","**"]
["UnsetMatchCompetitorText","??"]
["AwaitingMatchCompetitorText","…"]
["TournamentDate"]
["CurrentDate",{"$f":"NOW()","v":"2017-11-12T16:44:20.600"}]
["CurrentTime",{"$f":"MOD(NOW(),1)","v":"16:44:20.590"}]
["NormalWinState","W"]
["NormalLoseState","L"]

{"sheet":"CodeLists","index":11,"n_rows":129,"n_cols":30,"rows_kept":129,"cut":false,"hidden":true,"merged":[]}
["Announcement State",null,null,"Draw State",null,null,"Match State",null,null,"Match Competitor State",null,null,"Classification State",null,null,null,"TournamentSheetSeeding128",null,null,"TournamentSheetSeeding64",null,null,"TournamentSheetSeeding32",null,null,"TournamentSheetSeeding16",null,null,"TournamentSheetSeeding8"]
["A","Prijava",null,"S","Seed",null,"P","In progress",null,"DNF","Did not finish",null,"NEW","(nov)",null,null,1,null,null,1,1,null,1,1,null,1,1,null,1,1]
["L","Naknadna prijava",null,"F","Free",null,"A","Announced",null,"DNS","Did not start",null,"PROVISIONAL","Trenutna uvrstitev",null,null,2,null,null,2,64,null,2,32,null,2,16,null,2,8]
["*","Odjava",null,"*","Draw",null,"F","Finished",null,"FF","Forfeit",null,"FINAL","Končna uvrstitev",null,null,3,null,null,3,33,null,3,17,null,3,9,null,3,5]
["C","Odpoved",null,"A","Assigned",null,"S","Scheduled",null,"WO","Walkover",null,"DNS","Brez nastopa",null,null,4,null,null,4,32,null,4,16,null,4,8,null,4,4]
[null,null,null,"P","FinalPreQualified",null,null,null,null,"W","Win",null,"DNF","Odstop",null,null,5,null,null,5,17,null,5,9,null,5,5,null,5,3]
[null,null,null,null,null,null,null,null,null,"L","Lose",null,"DQ","Diskvalifikacija",null,null,6,null,null,6,48,null,6,24,null,6,12,null,6,6]
[null,null,null,null,null,null,null,null,null,"D","Draw",null,"CANCELED","Odpoved nastopa",null,null,7,null,null,7,49,null,7,25,null,7,13,null,7,7]
[null,null,null,null,null,null,null,null,null,"DQ","Disqualified",null,"UNKNOWN","(v obdelavi)",null,null,8,null,null,8,16,null,8,8,null,8,4,null,8,2]
[null,null,null,null,null,null,null,null,null,null,null,null,null,null,null,null,9,null,null,9,9,null,9,5,null,9,3]
[null,null,null,null,null,null,null,null,null,null,null,null,null,null,null,null,10,null,null,10,56,null,10,28,null,10,14]
[null,null,null,null,null,null,null,null,null,null,null,null,null,null,null,null,11,null,null,11,41,null,11,21,null,11,11]
[null,null,null,null,null,null,null,null,null,null,null,null,null,null,null,null,12,null,null,12,24,null,12,12,null,12,6]
[null,null,null,null,null,null,null,null,null,null,null,null,null,null,null,null,13,null,null,13,25,null,13,13,null,13,7]
[null,null,null,null,null,null,null,null,null,null,null,null,null,null,null,null,14,null,null,14,40,null,14,20,null,14,10]
[null,null,null,null,null,null,null,null,null,null,null,null,null,null,null,null,15,null,null,15,8,null,15,29,null,15,15]
[null,null,null,null,null,null,null,null,null,null,null,null,null,null,null,null,16,null,null,16,57,null,16,4,null,16,2]
[null,null,null,null,null,null,null,null,null,null,null,null,null,null,null,null,17,null,null,17,5,null,17,3]
[null,null,null,null,null,null,null,null,null,null,null,null,null,null,null,null,18,null,null,18,60,null,18,30]
[null,null,null,null,null,null,null,null,null,null,null,null,null,null,null,null,19,null,null,19,37,null,19,19]
[null,null,null,null,null,null,null,null,null,null,null,null,null,null,null,null,20,null,null,20,28,null,20,14]
[null,null,null,null,null,null,null,null,null,null,null,null,null,null,null,null,21,null,null,21,21,null,21,11]
[null,null,null,null,null,null,null,null,null,null,null,null,null,null,null,null,22,null,null,22,44,null,22,22]
[null,null,null,null,null,null,null,null,null,null,null,null,null,null,null,null,23,null,null,23,53,null,23,27]
[null,null,null,null,null,null,null,null,null,null,null,null,null,null,null,null,24,null,null,24,12,null,24,6]
[null,null,null,null,null,null,null,null,null,null,null,null,null,null,null,null,25,null,null,25,13,null,25,7]
[null,null,null,null,null,null,null,null,null,null,null,null,null,null,null,null,26,null,null,26,52,null,26,26]
[null,null,null,null,null,null,null,null,null,null,null,null,null,null,null,null,27,null,null,27,45,null,27,23]
[null,null,null,null,null,null,null,null,null,null,null,null,null,null,null,null,28,null,null,28,20,null,28,10]
[null,null,null,null,null,null,null,null,null,null,null,null,null,null,null,null,29,null,null,29,29,null,29,15]
[null,null,null,null,null,null,null,null,null,null,null,null,null,null,null,null,30,null,null,30,36,null,30,18]
[null,null,null,null,null,null,null,null,null,null,null,null,null,null,null,null,31,null,null,31,61,null,31,31]
[null,null,null,null,null,null,null,null,null,null,null,null,null,null,null,null,32,null,null,32,4,null,32,2]
[null,null,null,null,null,null,null,null,null,null,null,null,null,null,null,null,33,null,null,33,3]
[null,null,null,null,null,null,null,null,null,null,null,null,null,null,null,null,34,null,null,34,62]
[null,null,null,null,null,null,null,null,null,null,null,null,null,null,null,null,35,null,null,35,35]
[null,null,null,null,null,null,null,null,null,null,null,null,null,null,null,null,36,null,null,36,30]
[null,null,null,null,null,null,null,null,null,null,null,null,null,null,null,null,37,null,null,37,19]
[null,null,null,null,null,null,null,null,null,null,null,null,null,null,null,null,38,null,null,38,46]
[null,null,null,null,null,null,null,null,null,null,null,null,null,null,null,null,39,null,null,39,51]
[null,null,null,null,null,null,null,null,null,null,null,null,null,null,null,null,40,null,null,40,14]
[null,null,null,null,null,null,null,null,null,null,null,null,null,null,null,null,41,null,null,41,11]
[null,null,null,null,null,null,null,null,null,null,null,null,null,null,null,null,42,null,null,42,54]
[null,null,null,null,null,null,null,null,null,null,null,null,null,null,null,null,43,null,null,43,43]
[null,null,null,null,null,null,null,null,null,null,null,null,null,null,null,null,44,null,null,44,22]
[null,null,null,null,null,null,null,null,null,null,null,null,null,null,null,null,45,null,null,45,27]
[null,null,null,null,null,null,null,null,null,null,null,null,null,null,null,null,46,null,null,46,38]
[null,null,null,null,null,null,null,null,null,null,null,null,null,null,null,null,47,null,null,47,59]
[null,null,null,null,null,null,null,null,null,null,null,null,null,null,null,null,48,null,null,48,6]
[null,null,null,null,null,null,null,null,null,null,null,null,null,null,null,null,49,null,null,49,7]
[null,null,null,null,null,null,null,null,null,null,null,null,null,null,null,null,50,null,null,50,58]
[null,null,null,null,null,null,null,null,null,null,null,null,null,null,null,null,51,null,null,51,39]
[null,null,null,null,null,null,null,null,null,null,null,null,null,null,null,null,52,null,null,52,26]
[null,null,null,null,null,null,null,null,null,null,null,null,null,null,null,null,53,null,null,53,23]
[null,null,null,null,null,null,null,null,null,null,null,null,null,null,null,null,54,null,null,54,42]
[null,null,null,null,null,null,null,null,null,null,null,null,null,null,null,null,55,null,null,55,55]
[null,null,null,null,null,null,null,null,null,null,null,null,null,null,null,null,56,null,null,56,10]
[null,null,null,null,null,null,null,null,null,null,null,null,null,null,null,null,57,null,null,57,15]
[null,null,null,null,null,null,null,null,null,null,null,null,null,null,null,null,58,null,null,58,50]
[null,null,null,null,null,null,null,null,null,null,null,null,null,null,null,null,59,null,null,59,47]
[null,null,null,null,null,null,null,null,null,null,null,null,null,null,null,null,60,null,null,60,18]
[null,null,null,null,null,null,null,null,null,null,null,null,null,null,null,null,61,null,null,61,31]
[null,null,null,null,null,null,null,null,null,null,null,null,null,null,null,null,62,null,null,62,34]
[null,null,null,null,null,null,null,null,null,null,null,null,null,null,null,null,63,null,null,63,63]
[null,null,null,null,null,null,null,null,null,null,null,null,null,null,null,null,64,null,null,64,2]
[null,null,null,null,null,null,null,null,null,null,null,null,null,null,null,null,65]
[null,null,null,null,null,null,null,null,null,null,null,null,null,null,null,null,66]
[null,null,null,null,null,null,null,null,null,null,null,null,null,null,null,null,67]
[null,null,null,null,null,null,null,null,null,null,null,null,null,null,null,null,68]
[null,null,null,null,null,null,null,null,null,null,null,null,null,null,null,null,69]
[null,null,null,null,null,null,null,null,null,null,null,null,null,null,null,null,70]
[null,null,null,null,null,null,null,null,null,null,null,null,null,null,null,null,71]
[null,null,null,null,null,null,null,null,null,null,null,null,null,null,null,null,72]
[null,null,null,null,null,null,null,null,null,null,null,null,null,null,null,null,73]
[null,null,null,null,null,null,null,null,null,null,null,null,null,null,null,null,74]
[null,null,null,null,null,null,null,null,null,null,null,null,null,null,null,null,75]
[null,null,null,null,null,null,null,null,null,null,null,null,null,null,null,null,76]
[null,null,null,null,null,null,null,null,null,null,null,null,null,null,null,null,77]
[null,null,null,null,null,null,null,null,null,null,null,null,null,null,null,null,78]
[null,null,null,null,null,null,null,null,null,null,null,null,null,null,null,null,79]
[null,null,null,null,null,null,null,null,null,null,null,null,null,null,null,null,80]
[null,null,null,null,null,null,null,null,null,null,null,null,null,null,null,null,81]
[null,null,null,null,null,null,null,null,null,null,null,null,null,null,null,null,82]
[null,null,null,null,null,null,null,null,null,null,null,null,null,null,null,null,83]
[null,null,null,null,null,null,null,null,null,null,null,null,null,null,null,null,84]
[null,null,null,null,null,null,null,null,null,null,null,null,null,null,null,null,85]
[null,null,null,null,null,null,null,null,null,null,null,null,null,null,null,null,86]
[null,null,null,null,null,null,null,null,null,null,null,null,null,null,null,null,87]
[null,null,null,null,null,null,null,null,null,null,null,null,null,null,null,null,88]
[null,null,null,null,null,null,null,null,null,null,null,null,null,null,null,null,89]
[null,null,null,null,null,null,null,null,null,null,null,null,null,null,null,null,90]
[null,null,null,null,null,null,null,null,null,null,null,null,null,null,null,null,91]
[null,null,null,null,null,null,null,null,null,null,null,null,null,null,null,null,92]
[null,null,null,null,null,null,null,null,null,null,null,null,null,null,null,null,93]
[null,null,null,null,null,null,null,null,null,null,null,null,null,null,null,null,94]
[null,null,null,null,null,null,null,null,null,null,null,null,null,null,null,null,95]
[null,null,null,null,null,null,null,null,null,null,null,null,null,null,null,null,96]
[null,null,null,null,null,null,null,null,null,null,null,null,null,null,null,null,97]
[null,null,null,null,null,null,null,null,null,null,null,null,null,null,null,null,98]
[null,null,null,null,null,null,null,null,null,null,null,null,null,null,null,null,99]
[null,null,null,null,null,null,null,null,null,null,null,null,null,null,null,null,100]
[null,null,null,null,null,null,null,null,null,null,null,null,null,null,null,null,101]
[null,null,null,null,null,null,null,null,null,null,null,null,null,null,null,null,102]
[null,null,null,null,null,null,null,null,null,null,null,null,null,null,null,null,103]
[null,null,null,null,null,null,null,null,null,null,null,null,null,null,null,null,104]
[null,null,null,null,null,null,null,null,null,null,null,null,null,null,null,null,105]
[null,null,null,null,null,null,null,null,null,null,null,null,null,null,null,null,106]
[null,null,null,null,null,null,null,null,null,null,null,null,null,null,null,null,107]
[null,null,null,null,null,null,null,null,null,null,null,null,null,null,null,null,108]
[null,null,null,null,null,null,null,null,null,null,null,null,null,null,null,null,109]
[null,null,null,null,null,null,null,null,null,null,null,null,null,null,null,null,110]
[null,null,null,null,null,null,null,null,null,null,null,null,null,null,null,null,111]
[null,null,null,null,null,null,null,null,null,null,null,null,null,null,null,null,112]
[null,null,null,null,null,null,null,null,null,null,null,null,null,null,null,null,113]
[null,null,null,null,null,null,null,null,null,null,null,null,null,null,null,null,114]
[null,null,null,null,null,null,null,null,null,null,null,null,null,null,null,null,115]
[null,null,null,null,null,null,null,null,null,null,null,null,null,null,null,null,116]
[null,null,null,null,null,null,null,null,null,null,null,null,null,null,null,null,117]
[null,null,null,null,null,null,null,null,null,null,null,null,null,null,null,null,118]
[null,null,null,null,null,null,null,null,null,null,null,null,null,null,null,null,119]
[null,null,null,null,null,null,null,null,null,null,null,null,null,null,null,null,120]
[null,null,null,null,null,null,null,null,null,null,null,null,null,null,null,null,121]
[null,null,null,null,null,null,null,null,null,null,null,null,null,null,null,null,122]
[null,null,null,null,null,null,null,null,null,null,null,null,null,null,null,null,123]
[null,null,null,null,null,null,null,null,null,null,null,null,null,null,null,null,124]
[null,null,null,null,null,null,null,null,null,null,null,null,null,null,null,null,125]
[null,null,null,null,null,null,null,null,null,null,null,null,null,null,null,null,126]
[null,null,null,null,null,null,null,null,null,null,null,null,null,null,null,null,127]
[null,null,null,null,null,null,null,null,null,null,null,null,null,null,null,null,128]

{"sheet":"Navodila","index":12,"n_rows":17,"n_cols":2,"rows_kept":17,"cut":false,"hidden":false,"merged":[]}
["Korak"]
[1,"Vnesi predviden čas srečanja (levo zgoraj)."]
[2,"Vnesi potrebno št. dobljenih iger (desno zgoraj)"]
[3,"Ko se srečanje prične, označi status z A (desno spodaj). Vnese se čas pričetka srečanja."]
[4,"Vnesi rezultat (desno ob imenih)."]
[5,"Ko se srečanje konča, označi status s F (desno spodaj). Vnese se čas zaključka srečanja (spodaj). Če je rezultat pravilen in popoln, se vnesejo stanja rezultata (desno ob rezultatu: W in L)."]
[6,"Če se srečanje konča na neregularen način, poleg rezultata, če ta obstaja, vnesi stanja rezultata (npr.: WO in DNS)"]
[]
[]
[]
[]
["Primeri"]
[1,"Zmaga brez boja"]
[2,"Zaključen dvoboj"]
[3,"Aktiven dvoboj"]
[4,"Nepopoln dvoboj"]
[5,"Napovedan dvoboj"]

{"sheet":"List1","index":13,"n_rows":28,"n_cols":10,"rows_kept":28,"cut":false,"hidden":false,"merged":[]}
["Benedičič","Tomaž",1,"Biljard klub Break","Č",1,"Prijava",null,5,{"$f":"RAND()","v":0.2450078789992175}]
["Hvalec","Jan",919,"Biljard klub Break","Č",null,"Naknadna prijava",null,4,0.4238494825089093]
["Kokot","Lovro",915,"Biljard klub Break","Č",2,"Prijava",null,3,0.63053554517504873]
["Gradišnik","Mitja",92,"Biljard klub Direkt","Č",3,"Prijava",null,9,0.90658706990834648]
["Potočnik","Jurij",487,"Biljard klub Direkt","Č",4,"Prijava",null,32,0.79542650668972514]
["Rednak","Robert",178,"Biljard klub Direkt","Č",5,"Prijava",null,11,0.27620046701810919]
["Kerep","Damjan",300,"Biljard klub Fit-Fit","Č",11,"Prijava",null,13,0.31213299969647856]
["Erčulj","Matjaž",80,"Biljard klub Gomes","Č",6,"Prijava",null,25,0.58917980756497323]
["Fijavž","Peter",910,"Biljard klub Gomes","Č",7,"Prijava",null,24,0.52349765674455417]
["Gradišnik","Ana",551,"Biljard klub Gomes","Č",8,"Prijava",null,8,0.49675477927546763]
["Hamzovski","Kristijan",774,"Biljard klub Gomes","Č",9,"Prijava",null,30,0.6137025033923359]
["Messner","Beno",538,"Biljard klub Gomes","Č",14,"Prijava",null,12,0.76226497162863149]
["Mežek","Sašo",689,"Biljard klub Gorenc","Č",13,"Prijava",null,28,5.9057966758845226E-2]
["Gradišnik","Klemen",612,"Biljard klub Kaval Premium","Č",null,"Naknadna prijava",null,1,0.51593612033804159]
["Kolenc","Blaž",683,"Biljard klub Osmica","Č",10,"Prijava",null,17,0.47661961374818262]
["Raišič","Aleksander",220,"Biljard klub Osmica","Č",null,"Naknadna prijava",null,14,0.14558376873159273]
["Pemič","Boštjan",678,"Biljard klub Pipipool.com","Č",null,"Naknadna prijava",null,29,0.69936321173372951]
["Bajsič","Igor",799,"Klub biljardistov Ljubljana","Č",15,"Prijava",null,16,0.32238081531865148]
["Brajkovič","Matej",440,"Klub biljardistov Ljubljana","Č",24,"Prijava",null,21,0.20157217916758907]
["Čučnik","Franci",891,"Klub biljardistov Ljubljana","Č",16,"Prijava",null,19,0.56892380386911012]
["Gatej","Jožef",905,"Klub biljardistov Ljubljana","Č",17,"Prijava",null,20,0.36701183954433947]
["Gerčar","Maks",888,"Klub biljardistov Ljubljana","Č",18,"Prijava"]
["Godeša","Denis",723,"Klub biljardistov Ljubljana","Č",19,"Prijava"]
["Nikl","Kristijan",595,"Klub biljardistov Ljubljana","Č",20,"Prijava"]
["Porič","Nino",866,"Klub biljardistov Ljubljana","Č",21,"Prijava"]
["Tkalčič","Levin",720,"Klub biljardistov Ljubljana","Č",22,"Prijava"]
["Zajc","Miha",589,"Klub biljardistov Ljubljana","Č",23,"Prijava"]
["Lavrič","Janez",914,"Prosti igralci","Č",12,"Prijava"]

{"sheet":"Sheet2","index":14,"n_rows":46,"n_cols":6,"rows_kept":46,"cut":false,"hidden":false,"merged":[]}
[1]
[1,"Mitja GRADIŠNIK",null,null,null,"W"]
[null,"Aleksander RAIŠIČ",null,null,null,"L"]
[null,null,null,"",null,0]
[]
[]
[1]
[2,"Ana GRADIŠNIK"]
[null,"Damjan KEREP"]
[null,null,null,"",null,0]
[]
[]
[1]
[3,"Denis GODEŠA"]
[null,"Franci ČUČNIK"]
[null,null,null,"",null,0]
[]
[]
[1]
[4,"Igor BAJSIČ"]
[null,"Klemen GRADIŠNIK"]
[null,null,null,"",null,0]
[]
[]
[1]
[5,"Matjaž ERČULJ"]
[null,"Kristijan HAMZOVSKI"]
[null,null,null,"",null,0]
[]
[]
[1]
[6,"Matej BRAJKOVIČ"]
[null,"Miha ZAJC"]
[null,null,null,"",null,0]
[]
[]
[1]
[7,"Miha ŽAGAR"]
[null,"Nino PORIČ"]
[null,null,null,"",null,0]
[]
[]
[1]
[8,"Robert REDNAK"]
[null,"Jurij POTOČNIK"]
[null,null,null,"",null,0]

{"sheet":"Sheet1","index":15,"n_rows":29,"n_cols":22,"rows_kept":29,"cut":false,"hidden":false,"merged":[]}
[]
[]
[]
[null,null,null,null,null,null,null,1,1,"Mitja GRADIŠNIK",null,null,null,null,"SKUPINA","POZ. V SKUPINI"]
[null,null,null,null,null,null,null,null,null,1,null,null,null,1,0,0,"Aleksander RAIŠIČ",9,{"$f":"RAND()","v":0.47512557314956327},1,"Damjan KEREP",1]
[null,null,null,null,null,null,null,null,null,null,null,"",null,2,0,0,"Ana GRADIŠNIK",2,{"$f":"RAND()","v":0.11143692407192818},2,"Ana GRADIŠNIK",2]
[null,null,null,null,null,null,null,null,null,2,null,null,null,3,0,0,"Damjan KEREP",1,{"$f":"RAND()","v":0.45735624495237248},3,"Miha ZAJC",3]
[null,null,null,null,null,null,null,8,9,3,null,null,null,4,0,0,"Denis GODEŠA",4,{"$f":"RAND()","v":0.19571886328199017},4,"Denis GODEŠA",4]
[null,null,null,null,null,null,null,null,null,null,null,"",null,5,1,1,"Franci ČUČNIK",12,{"$f":"RAND()","v":0.82753137127033605},5,"Kristijan HAMZOVSKI",5]
[null,null,null,null,null,null,null,5,5,4,null,null,null,6,1,2,"Igor BAJSIČ",8,{"$f":"RAND()","v":0.76413754621731922},6,"Robert REDNAK",6]
[null,null,null,null,null,null,null,null,null,5,null,null,null,7,2,1,"Kristijan HAMZOVSKI",5,{"$f":"RAND()","v":0.85007811040353642},7,"Matej BRAJKOVIČ",7]
[null,null,null,null,null,null,null,null,null,null,null,null,null,8,2,2,"Matej BRAJKOVIČ",7,{"$f":"RAND()","v":0.30393441993075732},8,"Igor BAJSIČ",8]
[null,null,null,null,null,null,null,null,null,6,null,null,null,9,3,1,"Miha ZAJC",3,{"$f":"RAND()","v":0.78101413918106866},9,"Aleksander RAIŠIČ",9]
[null,null,null,null,null,null,null,4,4,"Klemen GRADIŠNIK",null,null,null,10,3,2,"Miha ŽAGAR",10,{"$f":"RAND()","v":1.463888467490404E-2},10,"Miha ŽAGAR",10]
[null,null,null,null,null,null,null,null,null,null,null,null,null,11,4,1,"Nino PORIČ",11,{"$f":"RAND()","v":0.21335492379506649},11,"Nino PORIČ",11]
[null,null,null,null,null,null,null,3,3,"Matjaž ERČULJ",null,null,null,12,4,2,"Robert REDNAK",6,{"$f":"RAND()","v":0.23495354261487311},12,"Franci ČUČNIK",12]
[null,null,null,null,null,null,null,null,null,7]
[null,null,null,null,null,null,null,null,null,null,null,null,null,null,null,null,"Aleksander RAIŠIČ",1]
[null,null,null,null,null,null,null,null,null,8,null,null,null,null,null,null,"Ana GRADIŠNIK",2]
[null,null,null,null,null,null,null,6,7,9,null,null,null,null,null,null,"Damjan KEREP",3]
[null,null,null,null,null,null,null,null,null,null,null,null,null,null,null,null,"Denis GODEŠA",4]
[null,null,null,null,null,null,null,7,8,10,null,null,null,null,null,null,"Franci ČUČNIK",5]
[null,null,null,null,null,null,null,null,null,11,null,null,null,null,null,null,"Igor BAJSIČ",6]
[null,null,null,null,null,null,null,null,null,null,null,null,null,null,null,null,"Kristijan HAMZOVSKI",7]
[null,null,null,null,null,null,null,null,null,12,null,null,null,null,null,null,"Matej BRAJKOVIČ",8]
[null,null,null,null,null,null,null,2,2,"Jurij POTOČNIK",null,null,null,null,null,null,"Miha ZAJC",9]
[null,null,null,null,null,null,null,null,null,null,null,"",null,null,null,null,"Miha ŽAGAR",10]
[null,null,null,null,null,null,null,null,null,null,null,null,null,null,null,null,"Nino PORIČ",11]
[null,null,null,null,null,null,null,null,null,null,null,null,null,null,null,null,"Robert REDNAK",12]