{"text_format":"1","workbook":"xlsx","n_sheets":8,"sheets":["Zapisnik","Prijave","Žreb","Skupina 1","Finalna skupina","Dvoboji","CodeLists","Configuration"],"not_rendered":{"charts":0,"images":0,"macros":1,"external_links":0,"defined_names":47,"comments":0,"pivot_tables":0},"unopened":[],"bounds":{"document_bytes":16777216,"sheet_cells":100000,"rows_first":2000,"rows_last":500,"rows_between":2000,"halvings":0,"cell_chars":16384,"cell_head_chars":4096},"cells_cut":0,"cells_raw":0,"read":"whole","date_system":"1900"}

{"sheet":"Zapisnik","index":0,"n_rows":23,"n_cols":3,"rows_kept":23,"cut":false,"hidden":false,"merged":[]}
[]
[null,"Zapisnik tekmovanja"]
[null,"Izpolni BZS"]
[null,"Tekmovanje","Seniorsko državno prvenstvo v osmici"]
[null,"Datum","2018-05-19"]
[null,"Organizator","Biljardna zveza Slovenije"]
{"$rows_left_out":18}
{"sheet":"Prijave","index":1,"n_rows":129,"n_cols":11,"rows_kept":129,"cut":false,"hidden":false,"merged":[]}
["Poz.","Tekmovalec",null,"Poz.","Priimek","Ime","Evid. št.","Društvo","Licenca","Nosilec","Prijava"]
[{"$f":"IF(NOT(ISBLANK(D2)),D2,\"\")","v":1},{"$f":"IF(COUNTBLANK(E2:K2)>0,\"\",CONCATENATE(F2,\" \",UPPER(E2)))","v":"Blaž PREDSEDENŠEK"},null,1,"Predsedenšek","Blaž",1,"Franckys Pub","T",11,"Prijava"]
[{"$f":"IF(NOT(ISBLANK(D3)),D3,\"\")","v":2},{"$f":"IF(COUNTBLANK(E3:K3)>0,\"\",CONCATENATE(F3,\" \",UPPER(E3)))","v":"Tomaž BENEDIČIČ"},null,2,"Benedičič","Tomaž",2,"Biljard klub Break","T",5,"Prijava"]
[3,{"$f":"IF(COUNTBLANK(E4:K4)>0,\"\",CONCATENATE(F4,\" \",UPPER(E4)))","v":"Tomaž VARVARIS"},null,3,"Varvaris","Tomaž",3,"Biljard klub Break","T",6,"Prijava"]
[4,"Marjan BRATIČ",null,4,"Bratič","Marjan",4,"Biljard klub Break","T",7,"Prijava"]
[5,"Odisej HUDOLIN",null,5,"Hudolin","Odisej",5,"Biljard klub Osmica","T",8,"Prijava"]
{"$rows_left_out":124}
{"sheet":"Žreb","index":2,"n_rows":129,"n_cols":11,"rows_kept":129,"cut":false,"hidden":false,"merged":[]}
["Nosilec","Poz.","Tekmovalec",null,"Nosilec","Status","Žreb","Pozicija","Tekmovalec","Zap. št. prijave","Nosilna poz."]
[{"$f":"Prijave!J2","v":11},{"$f":"Prijave!D2","v":1},{"$f":"Prijave!B2","v":"Blaž PREDSEDENŠEK"},null,1,"S",null,{"$f":"VLOOKUP(B2,INDIRECT(CONCATENATE(\"TournamentSheetSeeding\",Configuration!$B$1)),2,)","v":1},{"$f":"VLOOKUP(E2,DrawCompetitorSeedList,3,FALSE)","v":"Mihael ŠTRUCL"},{"$f":"VLOOKUP(E2,DrawCompetitorSeedList,2,FALSE)","v":18},{"$f":"VLOOKUP(E2,INDIRECT(CONCATENATE(\"TournamentSheetSeeding\",Configuration!$B$1)),2,)","v":1}]
[{"$f":"Prijave!J3","v":5},{"$f":"Prijave!D3","v":2},{"$f":"Prijave!B3","v":"Tomaž BENEDIČIČ"},null,2,"S",null,{"$f":"VLOOKUP(B3,INDIRECT(CONCATENATE(\"TournamentSheetSeeding\",Configuration!$B$1)),2,)","v":32},"Dejan SIMIČ",11,{"$f":"VLOOKUP(E3,INDIRECT(CONCATENATE(\"TournamentSheetSeeding\",Configuration!$B$1)),2,)","v":32}]
[{"$f":"Prijave!J4","v":6},{"$f":"Prijave!D4","v":3},{"$f":"Prijave!B4","v":"Tomaž VARVARIS"},null,3,"S",null,{"$f":"VLOOKUP(B4,INDIRECT(CONCATENATE(\"TournamentSheetSeeding\",Configuration!$B$1)),2,)","v":17},"Jože MARINKO",8,{"$f":"VLOOKUP(E4,INDIRECT(CONCATENATE(\"TournamentSheetSeeding\",Configuration!$B$1)),2,)","v":17}]
[{"$f":"Prijave!J5","v":7},{"$f":"Prijave!D5","v":4},{"$f":"Prijave!B5","v":"Marjan BRATIČ"},null,4,"S",null,{"$f":"VLOOKUP(B5,INDIRECT(CONCATENATE(\"TournamentSheetSeeding\",Configuration!$B$1)),2,)","v":16},"Alen SIMONIČ",15,{"$f":"VLOOKUP(E5,INDIRECT(CONCATENATE(\"TournamentSheetSeeding\",Configuration!$B$1)),2,)","v":16}]
[{"$f":"Prijave!J6","v":8},{"$f":"Prijave!D6","v":5},{"$f":"Prijave!B6","v":"Odisej HUDOLIN"},null,5,"*",null,9,"Tomaž BENEDIČIČ",2,9]
{"$rows_left_out":124}
{"sheet":"Skupina 1","index":3,"n_rows":144,"n_cols":101,"rows_kept":144,"cut":false,"hidden":false,"merged":[[114,31,115,31],[114,32,114,34],[115,32,115,34],[108,39,109,39],[108,40,108,42],[109,40,109,42],[132,39,133,39],[132,40,132,42],[133,40,133,42],[24,31,25,31],[24,32,24,34],[25,32,25,34],[72,31,73,31],[72,32,72,34],[73,32,73,34],[142,16,142,18],[89,17,89,18],[77,17,77,18],[36,24,36,26],[37,24,37,26],[125,33,125,34],[126,31,127,31],[126,32,126,34],[127,32,127,34],[137,33,137,34],[138,31,139,31],[138,32,138,34],[139,32,139,34],[101,33,101,34],[102,31,103,31],[102,32,102,34],[103,32,103,34],[113,33,113,34],[35,25,35,26],[59,25,59,26],[83,25,83,26],[101,25,101,26],[113,25,113,26],[125,25,125,26],[137,25,137,26],[138,23,139,23],[138,24,138,26],[139,24,139,26],[126,23,127,23],[126,24,126,26],[127,24,127,26],[114,23,115,23],[114,24,114,26],[115,24,115,26],[102,23,103,23],[102,24,102,26],[103,24,103,26],[60,23,61,23],[60,24,60,26],[61,24,61,26],[36,23,37,23],[140,9,140,10],[140,17,140,18],[141,7,142,7],[141,8,141,10],[141,15,142,15],[141,16,141,18],[142,8,142,10],[130,16,130,18],[134,9,134,10],[134,17,134,18],[135,7,136,7],[135,8,135,10],[135,15,136,15],[135,16,135,18],[136,8,136,10],[136,16,136,18],[128,9,128,10],[128,17,128,18],[129,7,130,7],[129,8,129,10],[129,15,130,15],[129,16,129,18],[130,8,130,10],[118,16,118,18],[122,9,122,10],[122,17,122,18],[123,7,124,7],[123,8,123,10],[123,15,124,15],[123,16,123,18],[124,8,124,10],[124,16,124,18],[116,9,116,10],[116,17,116,18],[117,7,118,7],[117,8,117,10],[117,15,118,15],[117,16,117,18],[118,8,118,10],[106,16,106,18],[110,9,110,10],[110,17,110,18],[111,7,112,7],[111,8,111,10],[111,15,112,15],[111,16,111,18],[112,8,112,10],[112,16,112,18],[104,9,104,10],[104,17,104,18],[105,7,106,7],[105,8,105,10],[105,15,106,15],[105,16,105,18],[106,8,106,10],[98,9,98,10],[98,17,98,18],[99,7,100,7],[99,8,99,10],[99,15,100,15],[99,16,99,18],[100,8,100,10],[100,16,100,18],[90,15,91,15],[90,16,90,18],[91,16,91,18],[92,9,92,10],[93,7,94,7],[93,8,93,10],[94,8,94,10],[84,23,85,23],[84,24,84,26],[85,24,85,26],[86,9,86,10],[87,7,88,7],[87,8,87,10],[88,8,88,10],[78,15,79,15],[78,16,78,18],[79,16,79,18],[80,9,80,10],[81,7,82,7],[81,8,81,10],[82,8,82,10],[68,9,68,10],[69,7,70,7],[69,8,69,10],[70,8,70,10],[74,9,74,10],[75,7,76,7],[75,8,75,10],[76,8,76,10],[62,9,62,10],[63,7,64,7],[63,8,63,10],[64,8,64,10],[65,17,65,18],[66,15,67,15],[66,16,66,18],[67,16,67,18],[56,9,56,10],[57,7,58,7],[57,8,57,10],[58,8,58,10],[50,9,50,10],[51,7,52,7],[51,8,51,10],[52,8,52,10],[53,17,53,18],[54,15,55,15],[54,16,54,18],[55,16,55,18],[41,17,41,18],[42,15,43,15],[42,16,42,18],[43,16,43,18],[44,9,44,10],[45,7,46,7],[45,8,45,10],[46,8,46,10],[38,9,38,10],[39,7,40,7],[39,8,39,10],[40,8,40,10],[29,17,29,18],[30,15,31,15],[30,16,30,18],[31,16,31,18],[32,9,32,10],[33,7,34,7],[33,8,33,10],[34,8,34,10],[20,9,20,10],[21,7,22,7],[21,8,21,10],[22,8,22,10],[26,9,26,10],[27,7,28,7],[27,8,27,10],[28,8,28,10],[14,9,14,10],[15,7,16,7],[15,8,15,10],[16,8,16,10],[17,17,17,18],[18,15,19,15],[18,16,18,18],[19,16,19,18],[8,9,8,10],[9,7,10,7],[9,8,9,10],[10,8,10,10],[12,23,13,23],[12,24,12,26],[13,24,13,26],[2,9,2,10],[3,7,4,7],[3,8,3,10],[4,8,4,10],[5,17,5,18],[6,15,7,15],[6,16,6,18],[7,16,7,18],[11,25,11,26]]}
["Nastavitve",null,null,null,null,null,null,null,null,null,null,null,null,null,null,null,null,null,null,null,null,null,null,null,null,null,null,null,null,null,null,null,null,null,null,null,null,null,null,null,null,null,null,null,null,null,null,null,null,null,null,null,null,null,null,null,null,null,null,null,null,null,null,null,null,null,null,null,null,null,null,null,null,null,null,null,null,null,"Match","Row","Col","Address","Group","Match nr.","Table","Scheduled time","Target","Notes","Start time","End time","Duration","P1 Name","P1 Code","P1 Score","P1 State","P2 Name","P2 Code","P2 Score","P2 State","Match State","Is Valid"]
["Skupina",1,null,null,null,null,1,null,null,null,null,null,null,null,null,null,null,null,null,null,null,null,null,null,null,null,null,null,null,null,null,null,null,null,null,null,null,null,null,null,null,null,null,null,null,null,null,null,null,null,null,null,null,null,null,null,null,null,null,null,null,null,null,null,null,null,null,null,null,null,null,null,null,null,null,null,null,null,1,{"$f":"ROW(H4)","v":4},{"$f":"COLUMN(H4)","v":8},{"$f":"ADDRESS(CB2,CC2)","v":"$H$4"},{"$f":"CONCATENATE($B$2)","v":"1"},{"$f":"INDIRECT(CD2)","v":1},{"$f":"CONCATENATE(OFFSET(INDIRECT(CD2),2,0))","v":""},{"$f":"OFFSET(INDIRECT(CD2),-1,1)","v":"10:00:00"},{"$f":"OFFSET(INDIRECT(CD2),-1,4)","v":4},{"$f":"CONCATENATE(OFFSET(INDIRECT(CD2),-1,2))","v":""},{"$f":"OFFSET(INDIRECT(CD2),2,1)","v":"10:00:00"},{"$f":"OFFSET(INDIRECT(CD2),2,2)","v":"10:00:00"},{"$f":"OFFSET(INDIRECT(CD2),2,3)","v":"00:00:00"},{"$f":"OFFSET(INDIRECT(CD2),0,1)","v":"Mihael ŠTRUCL"},{"$f":"VLOOKUP(CN2,AnnouncementListCompetitors,6,FALSE)","v":18},{"$f":"OFFSET(INDIRECT(CD2),0,4)","v":0},{"$f":"OFFSET(INDIRECT(CD2),0,5)","v":"WO"},{"$f":"OFFSET(INDIRECT(CD2),1,1)","v":""},{"$f":"VLOOKUP(CR2,AnnouncementListCompetitors,6,FALSE)","v":0},{"$f":"OFFSET(INDIRECT(CD2),1,4)","v":0},{"$f":"OFFSET(INDIRECT(CD2),1,5)","v":"DNS"},{"$f":"OFFSET(INDIRECT(CD2),2,4)","v":"F"},{"$f":"IF(OFFSET(INDIRECT(CD2),2,5)=1,TRUE,FALSE)","v":true}]
[null,null,null,null,null,null,{"$f":"CELL(\"address\",OFFSET($A$5,(G2-1)*2+1,0))","v":"$A$6"},{"$f":"IF(AND(NOT(ISBLANK(I4)),I4<>UnsetMatchCompetitorText,I4<>AwaitingMatchCompetitorText,NOT(ISBLANK(I5)),I5<>UnsetMatchCompetitorText,I5<>AwaitingMatchCompetitorText),1,IF(AND(I4<>AwaitingMatchCompetitorText,I5<>AwaitingMatchCompetitorText),-1,0))","v":1},"10:00:00",null,null,4,null,null,null,null,null,null,null,null,null,null,null,null,null,null,null,null,null,null,null,null,null,null,null,null,null,null,null,null,null,null,null,null,null,null,null,null,null,null,null,null,null,null,null,null,null,null,null,null,null,null,null,null,null,null,null,null,null,null,null,null,null,null,null,null,null,null,2,{"$f":"CB2+6","v":10},{"$f":"CC2","v":8},"$H$10",{"$f":"CONCATENATE($B$2)","v":"1"},2,"","10:00:00",4,"","10:00:00","11:00:00","01:00:00","Tomaž MIKAC",12,4,"W","Damijan KRAŠEVEC",22,3,"L","F",true]
[null,null,null,null,null,null,"*",{"$f":"G2","v":1},{"$f":"IF(G4=\"*\",IF(AND(OFFSET(INDIRECT(G3),0,0)>0,NOT(ISNA(OFFSET(INDIRECT(G3),0,1)))),OFFSET(INDIRECT(G3),0,1),UnsetMatchCompetitorText),IF(OFFSET(INDIRECT(G3),2,5)>0,IF(COUNTIF(INDIRECT(G4),(OFFSET(INDIRECT(G3),0,5)))>0,OFFSET(INDIRECT(G3),0,1),IF(COUNTIF(INDIRECT(G4),(OFFSET(INDIRECT(G3),1,5)))>0,OFFSET(INDIRECT(G3),1,1),BlankMatchCompetitorText)),AwaitingMatchCompetitorText))","v":"Mihael ŠTRUCL"},null,null,null,"WO",{"$f":"IF(M4=NormalWinState,AND(M5=NormalLoseState,L4>L5),TRUE)","v":true},null,null,null,null,null,null,null,null,null,null,null,null,null,null,null,null,null,null,null,null,null,null,null,null,null,null,null,null,null,null,null,null,null,null,null,null,null,null,null,null,null,null,null,null,null,null,null,null,null,null,null,null,null,null,null,null,null,null,null,null,null,null,null,null,3,16,8,"$H$16","1",3,"","10:00:00",4,"","10:00:00","11:00:00","01:00:00","Zoran RIBIČ",21,3,"L","Robi PEČE",6,4,"W","F",true]
["Poz.","Tekmovalec",null,null,null,null,{"$f":"CELL(\"address\",OFFSET($A$5,(G2-1)*2+2,0))","v":"$A$7"},null,{"$f":"IF(G6=\"*\",IF(AND(OFFSET(INDIRECT(G5),0,0)>0,NOT(ISNA(OFFSET(INDIRECT(G5),0,1)))),OFFSET(INDIRECT(G5),0,1),UnsetMatchCompetitorText),IF(OFFSET(INDIRECT(G5),2,5)>0,IF(COUNTIF(INDIRECT(G6),(OFFSET(INDIRECT(G5),0,5)))>0,OFFSET(INDIRECT(G5),0,1),IF(COUNTIF(INDIRECT(G6),(OFFSET(INDIRECT(G5),1,5)))>0,OFFSET(INDIRECT(G5),1,1),BlankMatchCompetitorText)),AwaitingMatchCompetitorText))","v":""},null,null,null,"DNS",{"$f":"IF(M5=NormalWinState,AND(M4=NormalLoseState,L5>L4),TRUE)","v":true},17,null,null,null,null,null,null,null,null,null,null,null,null,null,null,null,null,null,null,null,null,null,null,null,null,null,null,null,null,null,null,null,null,null,null,null,null,null,null,null,null,null,null,null,null,null,null,null,null,null,null,null,null,null,null,null,null,null,null,null,null,null,null,null,4,22,8,"$H$22","1",4,"","10:00:00",4,"","10:00:00","11:00:00","01:00:00","Boštjan MESSNER",17,4,"W","Martin PEVEC",23,0,"L","F",true]
[{"$f":"($B$2-1)*TournamentGroupSize+1","v":1},{"$f":"VLOOKUP(A6,DrawSheetPositionCompetitors,2,FALSE)","v":"Mihael ŠTRUCL"},null,null,null,null,"*",null,"10:00:00","10:00:00",{"$f":"IF(ISBLANK(I6),\"\",IF(ISBLANK(J6),CurrentTime-I6,J6-I6))","v":"00:00:00"},"F",{"$f":"IF(AND(COUNTIF(FinishedMatchStates,L6),NOT(ISNA(VLOOKUP(M4,MatchCompetitorStateCodes,1,FALSE))),NOT(ISNA(VLOOKUP(M5,MatchCompetitorStateCodes,1,FALSE))),COUNTIF(WinStates,M4)+COUNTIF(WinStates,M5)<=1,COUNTIF(LoseStates,M4)+COUNTIF(LoseStates,M5)<=1,IF(M4=NormalWinState,AND(M5=NormalLoseState,L4>L5),TRUE),IF(M5=NormalWinState,AND(M4=NormalLoseState,L5>L4),TRUE),NOT(ISBLANK(L3)),NOT(ISBLANK(I3)),NOT(ISBLANK(I6)),NOT(ISBLANK(J6)),H3>0),1,IF(COUNTIF(FinishedMatchStates,L6)>0,-1,0))","v":1},null,{"$f":"CELL(\"address\",H4)","v":"$H$4"},{"$f":"IF(AND(NOT(ISBLANK(Q7)),Q7<>UnsetMatchCompetitorText,Q7<>AwaitingMatchCompetitorText,NOT(ISBLANK(Q8)),Q8<>UnsetMatchCompetitorText,Q8<>AwaitingMatchCompetitorText),1,IF(AND(Q7<>AwaitingMatchCompetitorText,Q8<>AwaitingMatchCompetitorText),-1,0))","v":1},"13:00:00",null,null,4,null,null,null,null,null,null,null,null,null,null,null,null,null,null,null,null,null,null,null,null,null,null,null,null,null,null,null,null,null,null,null,null,null,null,null,null,null,null,null,null,null,null,null,null,null,null,null,null,null,null,null,null,null,null,null,null,null,null,5,28,8,"$H$28","1",5,"","10:00:00",4,"","10:00:00","11:00:00","01:00:00","Tomaž BENEDIČIČ",2,3,"L","Robert REDNAK",14,4,"W","F",true]
{"$rows_left_out":139}
{"sheet":"Finalna skupina","index":4,"n_rows":33,"n_cols":75,"rows_kept":33,"cut":false,"hidden":false,"merged":[[20,9,20,10],[21,7,22,7],[21,8,21,10],[22,8,22,10],[14,9,14,10],[15,7,16,7],[15,8,15,10],[16,8,16,10],[17,17,17,18],[18,15,19,15],[18,16,18,18],[19,16,19,18],[8,9,8,10],[9,7,10,7],[9,8,9,10],[10,8,10,10],[11,25,11,26],[12,23,13,23],[12,24,12,26],[13,24,13,26],[6,15,7,15],[6,16,6,18],[7,16,7,18],[2,9,2,10],[3,7,4,7],[3,8,3,10],[4,8,4,10],[5,17,5,18]]}
["Nastavitve",null,null,null,null,null,null,null,null,null,null,null,null,null,null,null,null,null,null,null,null,null,null,null,null,null,null,null,null,null,null,null,null,null,null,null,null,null,null,null,null,null,null,null,null,null,null,null,null,null,null,null,"Match","Row","Col","Address","Group","Match nr.","Table","Scheduled time","Target","Notes","Start time","End time","Duration","P1 Name","P1 Code","P1 Score","P1 State","P2 Name","P2 Code","P2 Score","P2 State","Match State","Is Valid"]
["Skupina","F",null,null,null,null,1,null,null,null,null,null,null,null,null,null,null,null,null,null,null,null,null,null,null,null,null,null,null,null,null,null,null,null,null,null,null,null,null,null,null,null,null,null,null,null,null,null,null,null,null,null,1,{"$f":"ROW(H4)","v":4},{"$f":"COLUMN(H4)","v":8},{"$f":"ADDRESS(BB2,BC2)","v":"$H$4"},{"$f":"CONCATENATE($B$2)","v":"F"},{"$f":"INDIRECT(BD2)","v":1},{"$f":"CONCATENATE(OFFSET(INDIRECT(BD2),2,0))","v":""},{"$f":"OFFSET(INDIRECT(BD2),-1,1)","v":"20:00:00"},{"$f":"OFFSET(INDIRECT(BD2),-1,4)","v":4},{"$f":"CONCATENATE(OFFSET(INDIRECT(BD2),-1,2))","v":""},{"$f":"OFFSET(INDIRECT(BD2),2,1)","v":"20:00:00"},{"$f":"OFFSET(INDIRECT(BD2),2,2)","v":"21:10:00"},{"$f":"OFFSET(INDIRECT(BD2),2,3)","v":"01:10:00"},{"$f":"OFFSET(INDIRECT(BD2),0,1)","v":"Robi PEČE"},{"$f":"VLOOKUP(BN2,AnnouncementListCompetitors,6,FALSE)","v":6},{"$f":"OFFSET(INDIRECT(BD2),0,4)","v":4},{"$f":"OFFSET(INDIRECT(BD2),0,5)","v":"W"},{"$f":"OFFSET(INDIRECT(BD2),1,1)","v":"Robert REDNAK"},{"$f":"VLOOKUP(BR2,AnnouncementListCompetitors,6,FALSE)","v":14},{"$f":"OFFSET(INDIRECT(BD2),1,4)","v":1},{"$f":"OFFSET(INDIRECT(BD2),1,5)","v":"L"},{"$f":"OFFSET(INDIRECT(BD2),2,4)","v":"F"},{"$f":"IF(OFFSET(INDIRECT(BD2),2,5)=1,TRUE,FALSE)","v":false}]
[null,null,null,null,null,null,{"$f":"CELL(\"address\",OFFSET($A$15,(G2-1)*2+1,0))","v":"$A$16"},{"$f":"IF(AND(NOT(ISBLANK(I4)),I4<>UnsetMatchCompetitorText,I4<>AwaitingMatchCompetitorText,NOT(ISBLANK(I5)),I5<>UnsetMatchCompetitorText,I5<>AwaitingMatchCompetitorText),1,IF(AND(I4<>AwaitingMatchCompetitorText,I5<>AwaitingMatchCompetitorText),-1,0))","v":1},"20:00:00",null,null,4,null,null,null,null,null,null,null,null,null,null,null,null,null,null,null,null,null,null,null,null,null,null,null,null,null,null,null,null,null,null,null,null,null,null,null,null,null,null,null,null,2,{"$f":"BB2+6","v":10},{"$f":"BC2","v":8},"$H$10",{"$f":"CONCATENATE($B$2)","v":"F"},2,"","20:00:00",4,"","20:00:00","21:10:00","01:10:00","Alen SIMONIČ",15,2,"L","Damijan KRAŠEVEC",22,4,"W","F",false]
[null,null,null,null,null,null,"*",{"$f":"G2","v":1},"Robi PEČE",null,null,4,"W",true,null,null,null,null,null,null,null,null,null,null,null,null,null,null,null,null,null,null,null,null,null,null,null,null,null,null,null,null,null,null,null,null,null,null,null,null,null,null,3,{"$f":"BB3+6","v":16},{"$f":"BC3","v":8},"$H$16","F",3,"","20:00:00",4,"","20:00:00","21:10:00","01:10:00","Jani DERŽIČ",23,1,"L","Mihael ŠTRUCL",18,4,"W","F",false]
["Žreb","Tekmovalec",null,null,null,null,{"$f":"CELL(\"address\",OFFSET($A$15,(G2-1)*2+2,0))","v":"$A$17"},null,"Robert REDNAK",null,null,1,"L",true,5,null,null,null,null,null,null,null,null,null,null,null,null,null,null,null,null,null,null,null,null,null,null,null,null,null,null,null,null,null,null,null,null,null,null,null,null,null,4,{"$f":"BB4+6","v":22},{"$f":"BC4","v":8},"$H$22","F",4,"","20:00:00",4,"","20:00:00","21:10:00","01:10:00","Dejan SIMIČ",11,4,"W","Tomaž BENEDIČIČ",2,3,"L","F",false]
[{"$f":"'Skupina 1'!C40","v":1},{"$f":"'Skupina 1'!B40","v":"Robi PEČE"},null,null,null,null,"*",null,"20:00:00","21:10:00",{"$f":"IF(ISBLANK(I6),\"\",IF(ISBLANK(J6),CurrentTime-I6,J6-I6))","v":"01:10:00"},"F",null,null,{"$f":"CELL(\"address\",H4)","v":"$H$4"},{"$f":"IF(AND(NOT(ISBLANK(Q7)),Q7<>UnsetMatchCompetitorText,Q7<>AwaitingMatchCompetitorText,NOT(ISBLANK(Q8)),Q8<>UnsetMatchCompetitorText,Q8<>AwaitingMatchCompetitorText),1,IF(AND(Q7<>AwaitingMatchCompetitorText,Q8<>AwaitingMatchCompetitorText),-1,0))","v":1},"21:20:00",null,null,5,null,null,null,null,null,null,null,null,null,null,null,null,null,null,null,null,null,null,null,null,null,null,null,null,null,null,null,null,null,null,null,null,5,{"$f":"ROW(P7)","v":7},{"$f":"COLUMN(P7)","v":16},"$P$7","F",5,"","21:20:00",5,"","21:20:00","22:20:00","01:00:00","Robi PEČE",6,5,"W","Damijan KRAŠEVEC",22,0,"L","F",false]
{"$rows_left_out":28}
{"sheet":"Dvoboji","index":5,"n_rows":60,"n_cols":19,"rows_kept":60,"cut":false,"hidden":true,"merged":[]}
["Group","Match nr.","Table","Scheduled time","Target","Notes","Start time","End time","Duration","P1 Name","P1 Code","P1 Score","P1 State","P2 Name","P2 Code","P2 Score","P2 State","Match State","Is Valid"]
[{"$f":"'Skupina 1'!CE2","v":"1"},{"$f":"'Skupina 1'!CF2","v":1},{"$f":"'Skupina 1'!CG2","v":""},{"$f":"'Skupina 1'!CH2","v":"10:00:00"},{"$f":"'Skupina 1'!CI2","v":4},{"$f":"'Skupina 1'!CJ2","v":""},{"$f":"'Skupina 1'!CK2","v":"10:00:00"},{"$f":"'Skupina 1'!CL2","v":"10:00:00"},{"$f":"'Skupina 1'!CM2","v":"00:00:00"},{"$f":"'Skupina 1'!CN2","v":"Mihael ŠTRUCL"},{"$f":"'Skupina 1'!CO2","v":18},{"$f":"'Skupina 1'!CP2","v":0},{"$f":"'Skupina 1'!CQ2","v":"WO"},{"$f":"'Skupina 1'!CR2","v":""},{"$f":"'Skupina 1'!CS2","v":0},{"$f":"'Skupina 1'!CT2","v":0},{"$f":"'Skupina 1'!CU2","v":"DNS"},{"$f":"'Skupina 1'!CV2","v":"F"},{"$f":"'Skupina 1'!CW2","v":true}]
[{"$f":"'Skupina 1'!CE3","v":"1"},{"$f":"'Skupina 1'!CF3","v":2},{"$f":"'Skupina 1'!CG3","v":""},{"$f":"'Skupina 1'!CH3","v":"10:00:00"},{"$f":"'Skupina 1'!CI3","v":4},{"$f":"'Skupina 1'!CJ3","v":""},{"$f":"'Skupina 1'!CK3","v":"10:00:00"},{"$f":"'Skupina 1'!CL3","v":"11:00:00"},{"$f":"'Skupina 1'!CM3","v":"01:00:00"},{"$f":"'Skupina 1'!CN3","v":"Tomaž MIKAC"},{"$f":"'Skupina 1'!CO3","v":12},{"$f":"'Skupina 1'!CP3","v":4},{"$f":"'Skupina 1'!CQ3","v":"W"},{"$f":"'Skupina 1'!CR3","v":"Damijan KRAŠEVEC"},{"$f":"'Skupina 1'!CS3","v":22},{"$f":"'Skupina 1'!CT3","v":3},{"$f":"'Skupina 1'!CU3","v":"L"},{"$f":"'Skupina 1'!CV3","v":"F"},{"$f":"'Skupina 1'!CW3","v":true}]
[{"$f":"'Skupina 1'!CE4","v":"1"},{"$f":"'Skupina 1'!CF4","v":3},{"$f":"'Skupina 1'!CG4","v":""},{"$f":"'Skupina 1'!CH4","v":"10:00:00"},{"$f":"'Skupina 1'!CI4","v":4},{"$f":"'Skupina 1'!CJ4","v":""},{"$f":"'Skupina 1'!CK4","v":"10:00:00"},{"$f":"'Skupina 1'!CL4","v":"11:00:00"},{"$f":"'Skupina 1'!CM4","v":"01:00:00"},{"$f":"'Skupina 1'!CN4","v":"Zoran RIBIČ"},{"$f":"'Skupina 1'!CO4","v":21},{"$f":"'Skupina 1'!CP4","v":3},{"$f":"'Skupina 1'!CQ4","v":"L"},{"$f":"'Skupina 1'!CR4","v":"Robi PEČE"},{"$f":"'Skupina 1'!CS4","v":6},{"$f":"'Skupina 1'!CT4","v":4},{"$f":"'Skupina 1'!CU4","v":"W"},{"$f":"'Skupina 1'!CV4","v":"F"},{"$f":"'Skupina 1'!CW4","v":true}]
[{"$f":"'Skupina 1'!CE5","v":"1"},{"$f":"'Skupina 1'!CF5","v":4},{"$f":"'Skupina 1'!CG5","v":""},{"$f":"'Skupina 1'!CH5","v":"10:00:00"},{"$f":"'Skupina 1'!CI5","v":4},{"$f":"'Skupina 1'!CJ5","v":""},{"$f":"'Skupina 1'!CK5","v":"10:00:00"},{"$f":"'Skupina 1'!CL5","v":"11:00:00"},{"$f":"'Skupina 1'!CM5","v":"01:00:00"},{"$f":"'Skupina 1'!CN5","v":"Boštjan MESSNER"},{"$f":"'Skupina 1'!CO5","v":17},{"$f":"'Skupina 1'!CP5","v":4},{"$f":"'Skupina 1'!CQ5","v":"W"},{"$f":"'Skupina 1'!CR5","v":"Martin PEVEC"},{"$f":"'Skupina 1'!CS5","v":23},{"$f":"'Skupina 1'!CT5","v":0},{"$f":"'Skupina 1'!CU5","v":"L"},{"$f":"'Skupina 1'!CV5","v":"F"},{"$f":"'Skupina 1'!CW5","v":true}]
[{"$f":"'Skupina 1'!CE6","v":"1"},{"$f":"'Skupina 1'!CF6","v":5},{"$f":"'Skupina 1'!CG6","v":""},{"$f":"'Skupina 1'!CH6","v":"10:00:00"},{"$f":"'Skupina 1'!CI6","v":4},{"$f":"'Skupina 1'!CJ6","v":""},{"$f":"'Skupina 1'!CK6","v":"10:00:00"},{"$f":"'Skupina 1'!CL6","v":"11:00:00"},{"$f":"'Skupina 1'!CM6","v":"01:00:00"},{"$f":"'Skupina 1'!CN6","v":"Tomaž BENEDIČIČ"},{"$f":"'Skupina 1'!CO6","v":2},{"$f":"'Skupina 1'!CP6","v":3},{"$f":"'Skupina 1'!CQ6","v":"L"},{"$f":"'Skupina 1'!CR6","v":"Robert REDNAK"},{"$f":"'Skupina 1'!CS6","v":14},{"$f":"'Skupina 1'!CT6","v":4},{"$f":"'Skupina 1'!CU6","v":"W"},{"$f":"'Skupina 1'!CV6","v":"F"},{"$f":"'Skupina 1'!CW6","v":true}]
{"$rows_left_out":55}
{"sheet":"CodeLists","index":6,"n_rows":129,"n_cols":30,"rows_kept":129,"cut":false,"hidden":true,"merged":[]}
["Announcement State",null,null,"Draw State",null,null,"Match State",null,null,"Match Competitor State",null,null,"Classification State",null,null,null,"TournamentSheetSeeding128",null,null,"TournamentSheetSeeding64",null,null,"TournamentSheetSeeding32",null,null,"TournamentSheetSeeding16",null,null,"TournamentSheetSeeding8"]
["A","Prijava",null,"S","Seed",null,"P","In progress",null,"DNF","Did not finish",null,"NEW","(nov)",null,null,1,null,null,1,1,null,1,1,null,1,1,null,1,1]
["L","Naknadna prijava",null,"F","Free",null,"A","Announced",null,"DNS","Did not start",null,"PROVISIONAL","Trenutna uvrstitev",null,null,2,null,null,2,64,null,2,32,null,2,16,null,2,8]
["*","Odjava",null,"*","Draw",null,"F","Finished",null,"FF","Forfeit",null,"FINAL","Končna uvrstitev",null,null,3,null,null,3,33,null,3,17,null,3,9,null,3,5]
["C","Odpoved",null,"A","Assigned",null,"S","Scheduled",null,"WO","Walkover",null,"DNS","Brez nastopa",null,null,4,null,null,4,32,null,4,16,null,4,8,null,4,4]
[null,null,null,null,null,null,null,null,null,"W","Win",null,"DNF","Odstop",null,null,5,null,null,5,17,null,5,9,null,5,5,null,5,3]
{"$rows_left_out":124}
{"sheet":"Configuration","index":7,"n_rows":18,"n_cols":4,"rows_kept":18,"cut":false,"hidden":true,"merged":[]}
["TournamentSize",32]
["TournamentGroupCount",1]
["TournamentGroupSize",32]
["TournamentFinalSize",8]
["FinishedMatchStates",{"$f":"CodeLists!$G$4","v":"F"}]
["AnnouncedMatchStates","A"]
{"$rows_left_out":12}